id_mutation,date_mutation,numero_disposition,nature_mutation,valeur_fonciere,adresse_numero,adresse_suffixe,adresse_nom_voie,adresse_code_voie,code_postal,code_commune,nom_commune,code_departement,ancien_code_commune,ancien_nom_commune,id_parcelle,ancien_id_parcelle,numero_volume,lot1_numero,lot1_surface_carrez,lot2_numero,lot2_surface_carrez,lot3_numero,lot3_surface_carrez,lot4_numero,lot4_surface_carrez,lot5_numero,lot5_surface_carrez,nombre_lots,code_type_local,type_local,surface_reelle_bati,nombre_pieces_principales,code_nature_culture,nature_culture,code_nature_culture_speciale,nature_culture_speciale,surface_terrain,longitude,latitude
2021-807378,2021-02-24,000001,Vente,247130,63,,RTE DES VIGNES,0020,46130,46124,Glanes,46,,,461240000A0020,,,,,,,,,,,,,0,3,Dépendance,,0,S,sols,,,500,1.854352,44.916537
2021-807378,2021-02-24,000001,Vente,247130,63,,RTE DES VIGNES,0020,46130,46124,Glanes,46,,,461240000A0020,,,,,,,,,,,,,0,3,Dépendance,,0,S,sols,,,500,1.854352,44.916537
2021-807378,2021-02-24,000001,Vente,247130,63,,RTE DES VIGNES,0020,46130,46124,Glanes,46,,,461240000A0020,,,,,,,,,,,,,0,3,Dépendance,,0,S,sols,,,500,1.854352,44.916537
2021-807378,2021-02-24,000001,Vente,247130,63,,RTE DES VIGNES,0020,46130,46124,Glanes,46,,,461240000A0020,,,,,,,,,,,,,0,1,Maison,115,3,J,jardins,POTAG,Jardin potager,2590,1.854352,44.916537
2021-807378,2021-02-24,000001,Vente,247130,63,,RTE DES VIGNES,0020,46130,46124,Glanes,46,,,461240000A0020,,,,,,,,,,,,,0,3,Dépendance,,0,S,sols,,,500,1.854352,44.916537
2021-807378,2021-02-24,000001,Vente,247130,63,,RTE DES VIGNES,0020,46130,46124,Glanes,46,,,461240000A0020,,,,,,,,,,,,,0,1,Maison,115,3,S,sols,,,500,1.854352,44.916537
2021-807378,2021-02-24,000001,Vente,247130,63,,RTE DES VIGNES,0020,46130,46124,Glanes,46,,,461240000A0020,,,,,,,,,,,,,0,3,Dépendance,,0,S,sols,,,500,1.854352,44.916537
2021-807378,2021-02-24,000001,Vente,247130,63,,RTE DES VIGNES,0020,46130,46124,Glanes,46,,,461240000A0020,,,,,,,,,,,,,0,3,Dépendance,,0,S,sols,,,500,1.854352,44.916537
2021-807378,2021-02-24,000001,Vente,247130,63,,RTE DES VIGNES,0020,46130,46124,Glanes,46,,,461240000A0020,,,,,,,,,,,,,0,3,Dépendance,,0,J,jardins,POTAG,Jardin potager,2590,1.854352,44.916537
2021-807378,2021-02-24,000001,Vente,247130,63,,RTE DES VIGNES,0020,46130,46124,Glanes,46,,,461240000A0020,,,,,,,,,,,,,0,3,Dépendance,,0,J,jardins,POTAG,Jardin potager,2590,1.854352,44.916537
2021-807378,2021-02-24,000001,Vente,247130,63,,RTE DES VIGNES,0020,46130,46124,Glanes,46,,,461240000A0020,,,,,,,,,,,,,0,3,Dépendance,,0,J,jardins,POTAG,Jardin potager,2590,1.854352,44.916537
2021-807378,2021-02-24,000001,Vente,247130,63,,RTE DES VIGNES,0020,46130,46124,Glanes,46,,,461240000A0020,,,,,,,,,,,,,0,3,Dépendance,,0,J,jardins,POTAG,Jardin potager,2590,1.854352,44.916537
2021-807378,2021-02-24,000001,Vente,247130,63,,RTE DES VIGNES,0020,46130,46124,Glanes,46,,,461240000A0020,,,,,,,,,,,,,0,3,Dépendance,,0,J,jardins,POTAG,Jardin potager,2590,1.854352,44.916537
2021-807378,2021-02-24,000001,Vente,247130,63,,RTE DES VIGNES,0020,46130,46124,Glanes,46,,,461240000A0020,,,,,,,,,,,,,0,3,Dépendance,,0,J,jardins,POTAG,Jardin potager,2590,1.854352,44.916537
2021-807378,2021-02-24,000001,Vente,247130,,,FOYT,B011,46130,46124,Glanes,46,,,461240000A0021,,,,,,,,,,,,,0,,,,,S,sols,,,10,1.854536,44.91676
2021-807961,2021-04-16,000001,Vente,7000,,,QUARANTEPEYRES,B038,46130,46124,Glanes,46,,,461240000A0302,,,,,,,,,,,,,0,,,,,VE,vergers,NOYER,Noyeraie ou noyers,3650,1.869937,44.9171
2021-807961,2021-04-16,000001,Vente,7000,,,QUARANTEPEYRES,B038,46130,46124,Glanes,46,,,461240000A0303,,,,,,,,,,,,,0,,,,,VE,vergers,NOYER,Noyeraie ou noyers,5080,1.86937,44.917197
2021-810030,2021-07-23,000001,Vente,22000,,,BOURNACHS ET LAVAYSSE,B003,46130,46124,Glanes,46,,,461240000B0697,,,,,,,,,,,,,0,,,,,T,terres,,,1541,1.878856,44.918261
2021-810363,2021-08-13,000001,Vente,100,,,PECH PIALAT,B029,46130,46124,Glanes,46,,,461240000A0679,,,,,,,,,,,,,0,,,,,P,prés,,,22,1.85871,44.918857
2021-810363,2021-08-13,000001,Vente,100,,,PECH PIALAT,B029,46130,46124,Glanes,46,,,461240000A0675,,,,,,,,,,,,,0,,,,,T,terres,,,4,1.858627,44.918887
2021-810363,2021-08-13,000001,Vente,100,,,PECH PIALAT,B029,46130,46124,Glanes,46,,,461240000A0677,,,,,,,,,,,,,0,,,,,VE,vergers,NOYER,Noyeraie ou noyers,98,1.859131,44.918893
2021-810440,2021-09-07,000002,Vente,5670,,,GLANES,B012,46130,46124,Glanes,46,,,461240000B0732,,,,,,,,,,,,,0,,,,,VE,vergers,NOYER,Noyeraie ou noyers,378,1.876567,44.920098
