id_mutation,date_mutation,numero_disposition,nature_mutation,valeur_fonciere,adresse_numero,adresse_suffixe,adresse_nom_voie,adresse_code_voie,code_postal,code_commune,nom_commune,code_departement,ancien_code_commune,ancien_nom_commune,id_parcelle,ancien_id_parcelle,numero_volume,lot1_numero,lot1_surface_carrez,lot2_numero,lot2_surface_carrez,lot3_numero,lot3_surface_carrez,lot4_numero,lot4_surface_carrez,lot5_numero,lot5_surface_carrez,nombre_lots,code_type_local,type_local,surface_reelle_bati,nombre_pieces_principales,code_nature_culture,nature_culture,code_nature_culture_speciale,nature_culture_speciale,surface_terrain,longitude,latitude
2021-806716,2021-01-07,000001,Vente,25063,,,CHEMIN DE FONTANES,B019,46240,46181,Lunegarde,46,,,461810000B0629,,,,,,,,,,,,,0,,,,,L,landes,,,5670,1.675299,44.683355
2021-806716,2021-01-07,000001,Vente,25063,,,CHEMIN DE FONTANES,B019,46240,46181,Lunegarde,46,,,461810000B0630,,,,,,,,,,,,,0,,,,,L,landes,PACAG,Pacage,7040,1.675827,44.683804
2021-806716,2021-01-07,000001,Vente,25063,,,CHEMIN DE FONTANES,B019,46240,46181,Lunegarde,46,,,461810000B0631,,,,,,,,,,,,,0,,,,,L,landes,PACAG,Pacage,1225,1.675753,44.684196
2021-806716,2021-01-07,000001,Vente,25063,,,CHEMIN DE FONTANES,B019,46240,46181,Lunegarde,46,,,461810000B0632,,,,,,,,,,,,,0,,,,,L,landes,,,5190,1.676221,44.684561
2021-806716,2021-01-07,000001,Vente,25063,,,LA FANGASSE,B027,46240,46181,Lunegarde,46,,,461810000B0637,,,,,,,,,,,,,0,,,,,T,terres,,,1403,1.677802,44.686003
2021-806716,2021-01-07,000001,Vente,25063,,,LA FANGASSE,B027,46240,46181,Lunegarde,46,,,461810000B0637,,,,,,,,,,,,,0,,,,,L,landes,,,1727,1.677802,44.686003
2021-806716,2021-01-07,000001,Vente,25063,,,LA FANGASSE,B027,46240,46181,Lunegarde,46,,,461810000B0638,,,,,,,,,,,,,0,,,,,T,terres,,,3300,1.678417,44.68565
2021-806716,2021-01-07,000001,Vente,25063,,,LA FANGASSE,B027,46240,46181,Lunegarde,46,,,461810000B0639,,,,,,,,,,,,,0,,,,,T,terres,,,3825,1.678902,44.685721
2021-806716,2021-01-07,000001,Vente,25063,,,LA FANGASSE,B027,46240,46181,Lunegarde,46,,,461810000B0640,,,,,,,,,,,,,0,,,,,L,landes,,,2445,1.679583,44.685119
2021-806716,2021-01-07,000001,Vente,25063,,,LA FANGASSE,B027,46240,46181,Lunegarde,46,,,461810000B0641,,,,,,,,,,,,,0,,,,,T,terres,,,6075,1.679841,44.685537
2021-806716,2021-01-07,000001,Vente,25063,,,LA FANGASSE,B027,46240,46181,Lunegarde,46,,,461810000B0642,,,,,,,,,,,,,0,,,,,T,terres,,,8145,1.680554,44.684679
2021-806716,2021-01-07,000001,Vente,25063,,,LA FANGASSE,B027,46240,46181,Lunegarde,46,,,461810000B0643,,,,,,,,,,,,,0,,,,,T,terres,,,2185,1.681288,44.684872
2021-806716,2021-01-07,000001,Vente,25063,,,LA FANGASSE,B027,46240,46181,Lunegarde,46,,,461810000B0644,,,,,,,,,,,,,0,,,,,T,terres,,,2400,1.680889,44.685136
2021-806716,2021-01-07,000001,Vente,25063,,,LA FANGASSE,B027,46240,46181,Lunegarde,46,,,461810000B0645,,,,,,,,,,,,,0,,,,,T,terres,,,4470,1.68164,44.685238
2021-806716,2021-01-07,000001,Vente,25063,,,LA FANGASSE,B027,46240,46181,Lunegarde,46,,,461810000B0652,,,,,,,,,,,,,0,,,,,T,terres,,,5260,1.680853,44.685914
2021-806716,2021-01-07,000001,Vente,25063,,,LA FANGASSE,B027,46240,46181,Lunegarde,46,,,461810000B0653,,,,,,,,,,,,,0,,,,,T,terres,,,8840,1.679888,44.686918
2021-806716,2021-01-07,000001,Vente,25063,,,LA FANGASSE,B027,46240,46181,Lunegarde,46,,,461810000B0654,,,,,,,,,,,,,0,,,,,T,terres,,,2815,1.67936,44.68622
2021-806716,2021-01-07,000001,Vente,25063,,,LA FANGASSE,B027,46240,46181,Lunegarde,46,,,461810000B0655,,,,,,,,,,,,,0,,,,,L,landes,,,2045,1.678984,44.686015
2021-806716,2021-01-07,000001,Vente,25063,,,LA FANGASSE,B027,46240,46181,Lunegarde,46,,,461810000B0656,,,,,,,,,,,,,0,,,,,T,terres,,,15600,1.678975,44.686926
2021-806716,2021-01-07,000001,Vente,25063,,,LA FANGASSE,B027,46240,46181,Lunegarde,46,,,461810000B0657,,,,,,,,,,,,,0,,,,,L,landes,,,1850,1.680273,44.686994
2021-806716,2021-01-07,000001,Vente,25063,,,LA FANGASSE,B027,46240,46181,Lunegarde,46,,,461810000B0658,,,,,,,,,,,,,0,,,,,L,landes,,,2805,1.680951,44.686597
2021-806716,2021-01-07,000001,Vente,25063,,,LA FANGASSE,B027,46240,46181,Lunegarde,46,,,461810000B0659,,,,,,,,,,,,,0,,,,,L,landes,,,6715,1.680956,44.687248
2021-806716,2021-01-07,000001,Vente,25063,,,LA FANGASSE,B027,46240,46181,Lunegarde,46,,,461810000B0660,,,,,,,,,,,,,0,,,,,T,terres,,,1750,1.680756,44.688056
2021-806716,2021-01-07,000001,Vente,25063,,,LA FANGASSE,B027,46240,46181,Lunegarde,46,,,461810000B0661,,,,,,,,,,,,,0,,,,,L,landes,,,8480,1.680511,44.687685
2021-806716,2021-01-07,000001,Vente,25063,,,LA FANGASSE,B027,46240,46181,Lunegarde,46,,,461810000B0662,,,,,,,,,,,,,0,,,,,T,terres,,,5590,1.681788,44.688344
2021-806716,2021-01-07,000001,Vente,25063,,,LA FANGASSE,B027,46240,46181,Lunegarde,46,,,461810000B0663,,,,,,,,,,,,,0,,,,,T,terres,,,3365,1.682125,44.687934
2021-806716,2021-01-07,000001,Vente,25063,,,CHEMIN DE FONTANES,B019,46240,46181,Lunegarde,46,,,461810000B1002,,,,,,,,,,,,,0,,,,,L,landes,,,7681,1.67691,44.684629
2021-806716,2021-01-07,000001,Vente,25063,,,CHEMIN DE FONTANES,B019,46240,46181,Lunegarde,46,,,461810000B1002,,,,,,,,,,,,,0,,,,,T,terres,,,11214,1.67691,44.684629
2021-807644,2021-03-18,000001,Vente,17196,,,JOUNCAYROLES,B046,46240,46181,Lunegarde,46,,,461810000B0668,,,,,,,,,,,,,0,,,,,BT,taillis simples,,,31530,1.671162,44.678323
2021-807644,2021-03-18,000001,Vente,17196,,,JOUNCAYROLES,B046,46240,46181,Lunegarde,46,,,461810000B0669,,,,,,,,,,,,,0,,,,,L,landes,PACAG,Pacage,2600,1.671174,44.67822
2021-807644,2021-03-18,000001,Vente,17196,,,JOUNCAYROLES,B046,46240,46181,Lunegarde,46,,,461810000B0672,,,,,,,,,,,,,0,,,,,L,landes,,,9570,1.676148,44.682305
2021-807644,2021-03-18,000001,Vente,17196,,,JOUNCAYROLES,B046,46240,46181,Lunegarde,46,,,461810000B0674,,,,,,,,,,,,,0,,,,,L,landes,,,8795,1.675792,44.681576
2021-807644,2021-03-18,000001,Vente,17196,,,JOUNCAYROLES,B046,46240,46181,Lunegarde,46,,,461810000B0675,,,,,,,,,,,,,0,,,,,L,landes,,,1705,1.674909,44.681608
2021-807644,2021-03-18,000001,Vente,17196,,,JOUNCAYROLES,B046,46240,46181,Lunegarde,46,,,461810000B0676,,,,,,,,,,,,,0,,,,,S,sols,,,40,1.674969,44.681392
2021-807644,2021-03-18,000001,Vente,17196,,,JOUNCAYROLES,B046,46240,46181,Lunegarde,46,,,461810000B0677,,,,,,,,,,,,,0,,,,,L,landes,,,1470,1.675447,44.681446
2021-807644,2021-03-18,000001,Vente,17196,,,JOUNCAYROLES,B046,46240,46181,Lunegarde,46,,,461810000B0678,,,,,,,,,,,,,0,,,,,L,landes,,,1785,1.675001,44.681314
2021-807644,2021-03-18,000001,Vente,17196,,,JOUNCAYROLES,B046,46240,46181,Lunegarde,46,,,461810000B0679,,,,,,,,,,,,,0,,,,,BT,taillis simples,,,2790,1.675807,44.681039
2021-807644,2021-03-18,000001,Vente,17196,,,JOUNCAYROLES,B046,46240,46181,Lunegarde,46,,,461810000B0680,,,,,,,,,,,,,0,,,,,L,landes,,,5470,1.674968,44.68103
2021-807644,2021-03-18,000001,Vente,17196,,,JOUNCAYROLES,B046,46240,46181,Lunegarde,46,,,461810000B0689,,,,,,,,,,,,,0,,,,,L,landes,PACAG,Pacage,11875,1.673675,44.67872
2021-807644,2021-03-18,000001,Vente,17196,,,JOUNCAYROLES,B046,46240,46181,Lunegarde,46,,,461810000B0691,,,,,,,,,,,,,0,,,,,T,terres,,,4860,1.672127,44.67709
2021-807644,2021-03-18,000001,Vente,17196,,,JOUNCAYROLES,B046,46240,46181,Lunegarde,46,,,461810000B0692,,,,,,,,,,,,,0,,,,,BT,taillis simples,,,33175,1.672699,44.677284
2021-807644,2021-03-18,000001,Vente,17196,,,JOUNCAYROLES,B046,46240,46181,Lunegarde,46,,,461810000B0993,,,,,,,,,,,,,0,,,,,T,terres,,,3846,1.672594,44.678942
2021-807644,2021-03-18,000001,Vente,17196,,,JOUNCAYROLES,B046,46240,46181,Lunegarde,46,,,461810000B0993,,,,,,,,,,,,,0,,,,,L,landes,PACAG,Pacage,4979,1.672594,44.678942
2021-807644,2021-03-18,000001,Vente,17196,,,JOUNCAYROLES,B046,46240,46181,Lunegarde,46,,,461810000B1005,,,,,,,,,,,,,0,,,,,T,terres,,,12535,1.673851,44.677964
2021-807922,2021-04-08,000001,Vente,7841,,,FOND DELEOUNE BAS,B034,46240,46181,Lunegarde,46,,,461810000B0708,,,,,,,,,,,,,0,,,,,T,terres,,,11180,1.679681,44.680536
2021-807922,2021-04-08,000001,Vente,7841,,,PECH NOUYROU,B063,46240,46181,Lunegarde,46,,,461810000B0990,,,,,,,,,,,,,0,,,,,T,terres,,,19845,1.680917,44.678463
2021-810887,2021-09-15,000001,Vente,142333,,,CAMP DU MOULIN,B017,46240,46181,Lunegarde,46,,,461810000A0071,,,,,,,,,,,,,0,,,,,BT,taillis simples,,,31337,1.68318,44.689721
2021-810887,2021-09-15,000001,Vente,142333,,,CAMP DU MOULIN,B017,46240,46181,Lunegarde,46,,,461810000A0071,,,,,,,,,,,,,0,,,,,BT,taillis simples,,,15668,1.68318,44.689721
2021-810887,2021-09-15,000001,Vente,142333,,,CAMP DU MOULIN,B017,46240,46181,Lunegarde,46,,,461810000A0072,,,,,,,,,,,,,0,,,,,T,terres,,,1910,1.684878,44.689573
2021-810887,2021-09-15,000001,Vente,142333,,,CAMP DU MOULIN,B017,46240,46181,Lunegarde,46,,,461810000A0073,,,,,,,,,,,,,0,,,,,S,sols,,,20,1.686116,44.689627
2021-810887,2021-09-15,000001,Vente,142333,,,LE BOURG,B075,46240,46181,Lunegarde,46,,,461810000B0947,,,,,,,,,,,,,0,,,,,T,terres,,,1795,1.686772,44.690145
2021-810887,2021-09-15,000001,Vente,142333,,,LE BOURG,B075,46240,46181,Lunegarde,46,,,461810000B0948,,,,,,,,,,,,,0,,,,,J,jardins,POTAG,Jardin potager,5080,1.685725,44.689831
2021-810887,2021-09-15,000001,Vente,142333,5050,,LE BOURG,B075,46240,46181,Lunegarde,46,,,461810000B0949,,,,,,,,,,,,,0,4,Local industriel. commercial ou assimilé,,0,S,sols,,,4780,1.685947,44.69013
2021-810887,2021-09-15,000001,Vente,142333,,,LE BOURG,B075,46240,46181,Lunegarde,46,,,461810000B0950,,,,,,,,,,,,,0,,,,,T,terres,,,4010,1.686301,44.690559
2021-812123,2021-12-02,000002,Vente,495,,,LE BOURG,B075,46240,46181,Lunegarde,46,,,461810000B1148,,,,,,,,,,,,,0,,,,,S,sols,,,21,1.688321,44.690978
2021-812430,2021-12-03,000001,Vente,1000,5140,F,LE BOURG,B075,46240,46181,Lunegarde,46,,,461810000B1140,,,1,,,,,,,,,,1,3,Dépendance,,0,,,,,,1.68836,44.69054
2021-812539,2021-12-17,000001,Vente,289000,5043,,LE BOURG,B075,46240,46181,Lunegarde,46,,,461810000B0933,,,,,,,,,,,,,0,1,Maison,122,4,S,sols,,,667,1.68785,44.690253
2021-812539,2021-12-17,000001,Vente,289000,5043,,LE BOURG,B075,46240,46181,Lunegarde,46,,,461810000B0933,,,,,,,,,,,,,0,3,Dépendance,,0,S,sols,,,667,1.68785,44.690253
2021-812539,2021-12-17,000001,Vente,289000,5043,,LE BOURG,B075,46240,46181,Lunegarde,46,,,461810000B0933,,,,,,,,,,,,,0,4,Local industriel. commercial ou assimilé,20,0,S,sols,,,667,1.68785,44.690253
