id_mutation,date_mutation,numero_disposition,nature_mutation,valeur_fonciere,adresse_numero,adresse_suffixe,adresse_nom_voie,adresse_code_voie,code_postal,code_commune,nom_commune,code_departement,ancien_code_commune,ancien_nom_commune,id_parcelle,ancien_id_parcelle,numero_volume,lot1_numero,lot1_surface_carrez,lot2_numero,lot2_surface_carrez,lot3_numero,lot3_surface_carrez,lot4_numero,lot4_surface_carrez,lot5_numero,lot5_surface_carrez,nombre_lots,code_type_local,type_local,surface_reelle_bati,nombre_pieces_principales,code_nature_culture,nature_culture,code_nature_culture_speciale,nature_culture_speciale,surface_terrain,longitude,latitude
2021-806541,2021-01-11,000001,Vente,102470,5194,F,FONTAINE DE SABY,B149,46700,46187,Mauroux,46,,,461870000A1194,,,,,,,,,,,,,0,4,Local industriel. commercial ou assimilé,75,0,S,sols,,,277,1.028905,44.460841
2021-806628,2021-01-08,000001,Vente,120000,5715,F,TRUSSAL ET PRIEUR,B330,46700,46187,Mauroux,46,,,461870000F0715,,,,,,,,,,,,,0,1,Maison,87,4,T,terres,,,1102,1.051262,44.450975
2021-806628,2021-01-08,000001,Vente,120000,5715,F,TRUSSAL ET PRIEUR,B330,46700,46187,Mauroux,46,,,461870000F0715,,,,,,,,,,,,,0,1,Maison,87,4,S,sols,,,500,1.051262,44.450975
2021-806800,2021-02-09,000001,Vente,70000,5154,,LABORDE,B188,46700,46187,Mauroux,46,,,461870000F0469,,,,,,,,,,,,,0,1,Maison,120,6,S,sols,,,1735,1.048387,44.450248
2021-806892,2021-01-16,000002,Vente,18000,,,PAILLARGUES ET PRIEUR,B238,46700,46187,Mauroux,46,,,461870000E0022,,,,,,,,,,,,,0,,,,,L,landes,,,2175,1.042457,44.437695
2021-806892,2021-01-16,000002,Vente,18000,,,PAILLARGUES ET PRIEUR,B238,46700,46187,Mauroux,46,,,461870000E0023,,,,,,,,,,,,,0,,,,,BS,taillis sous futaie,,,2655,1.042226,44.437377
2021-806892,2021-01-16,000002,Vente,18000,,,PAILLARGUES ET PRIEUR,B238,46700,46187,Mauroux,46,,,461870000E1193,,,,,,,,,,,,,0,,,,,T,terres,,,918,1.042162,44.439908
2021-806892,2021-01-16,000002,Vente,18000,,,PAILLARGUES ET PRIEUR,B238,46700,46187,Mauroux,46,,,461870000E1197,,,,,,,,,,,,,0,,,,,T,terres,,,5657,1.042937,44.44127
2021-806892,2021-01-16,000002,Vente,18000,,,PAILLARGUES ET PRIEUR,B238,46700,46187,Mauroux,46,,,461870000E1199,,,,,,,,,,,,,0,,,,,T,terres,,,703,1.043819,44.441476
2021-806892,2021-01-16,000002,Vente,18000,,,PAILLARGUES ET PRIEUR,B238,46700,46187,Mauroux,46,,,461870000E1201,,,,,,,,,,,,,0,,,,,T,terres,,,1404,1.042234,44.440657
2021-806892,2021-01-16,000002,Vente,18000,,,PAILLARGUES ET PRIEUR,B238,46700,46187,Mauroux,46,,,461870000E1203,,,,,,,,,,,,,0,,,,,T,terres,,,1781,1.042328,44.440292
2021-806962,2021-02-01,000001,Vente,40950,5114,F,REYNOU ET CLOS DEL CAPRE,B358,46700,46187,Mauroux,46,,,461870000C0114,,,33,60.36,,,,,,,,,1,4,Local industriel. commercial ou assimilé,61,0,,,,,,1.062267,44.451554
2021-807006,2021-01-29,000001,Vente,28000,,,LES TROIS NOYERS,B325,46700,46187,Mauroux,46,,,461870000F0742,,,,,,,,,,,,,0,,,,,AB,terrains a bâtir,,,700,1.051803,44.447213
2021-807006,2021-01-29,000001,Vente,28000,,,LES TROIS NOYERS,B325,46700,46187,Mauroux,46,,,461870000F0743,,,,,,,,,,,,,0,,,,,BS,taillis sous futaie,,,632,1.051988,44.447036
2021-807006,2021-01-29,000001,Vente,28000,,,CHAMP DE FABRE,B071,46700,46187,Mauroux,46,,,461870000F0793,,,,,,,,,,,,,0,,,,,BS,taillis sous futaie,,,33,1.051934,44.446892
2021-807006,2021-01-29,000001,Vente,28000,,,CHAMP DE FABRE,B071,46700,46187,Mauroux,46,,,461870000F0794,,,,,,,,,,,,,0,,,,,AB,terrains a bâtir,,,14,1.0517,44.447132
2021-807006,2021-01-29,000001,Vente,28000,,,LES TROIS NOYERS,B325,46700,46187,Mauroux,46,,,461870000F0815,,,,,,,,,,,,,0,,,,,L,landes,,,1425,1.052148,44.446937
2021-807006,2021-01-29,000001,Vente,28000,,,LES TROIS NOYERS,B325,46700,46187,Mauroux,46,,,461870000F0816,,,,,,,,,,,,,0,,,,,AB,terrains a bâtir,,,191,1.051963,44.447341
2021-807007,2021-01-30,000001,Vente,2200,,,LES MIRANDES BRAS DE L HOM,B224,46700,46187,Mauroux,46,,,461870000D0079,,,,,,,,,,,,,0,,,,,BS,taillis sous futaie,,,2910,1.068084,44.437034
2021-807121,2021-02-04,000001,Vente,110000,5673,F,TRUSSAL ET PRIEUR,B330,46700,46187,Mauroux,46,,,461870000F0673,,,,,,,,,,,,,0,1,Maison,99,4,S,sols,,,1161,1.050516,44.450885
2021-807121,2021-02-04,000001,Vente,110000,,,TRUSSAL ET PRIEUR,B330,46700,46187,Mauroux,46,,,461870000F0697,,,,,,,,,,,,,0,,,,,L,landes,,,990,1.050231,44.450803
2021-807121,2021-02-04,000001,Vente,110000,,,TRUSSAL ET PRIEUR,B330,46700,46187,Mauroux,46,,,461870000F0699,,,,,,,,,,,,,0,,,,,T,terres,,,312,1.050799,44.450808
2021-807121,2021-02-04,000001,Vente,110000,,,TRUSSAL ET PRIEUR,B330,46700,46187,Mauroux,46,,,461870000F0702,,,,,,,,,,,,,0,,,,,L,landes,,,176,1.050636,44.450599
2021-807287,2021-03-09,000001,Vente,36000,,,LE CLOS DE CHIOZE,B090,46700,46187,Mauroux,46,,,461870000A1139,,,,,,,,,,,,,0,,,,,T,terres,,,295,1.034477,44.466724
2021-807287,2021-03-09,000001,Vente,36000,,,LE CLOS DE CHIOZE,B090,46700,46187,Mauroux,46,,,461870000A1141,,,,,,,,,,,,,0,,,,,T,terres,,,219,1.034425,44.466688
2021-807287,2021-03-09,000001,Vente,36000,,,LE CLOS DE CHIOZE,B090,46700,46187,Mauroux,46,,,461870000A1159,,,,,,,,,,,,,0,,,,,AB,terrains a bâtir,,,1000,1.034809,44.467002
2021-807287,2021-03-09,000001,Vente,36000,,,LE CLOS DE CHIOZE,B090,46700,46187,Mauroux,46,,,461870000A1159,,,,,,,,,,,,,0,,,,,T,terres,,,1480,1.034809,44.467002
2021-807380,2021-02-26,000001,Vente,25000,,,LES TROIS NOYERS,B325,46700,46187,Mauroux,46,,,461870000F0736,,,,,,,,,,,,,0,,,,,AB,terrains a bâtir,,,1982,1.052123,44.448179
2021-807380,2021-02-26,000001,Vente,25000,,,LES TROIS NOYERS,B325,46700,46187,Mauroux,46,,,461870000F0825,,,,,,,,,,,,,0,,,,,AB,terrains a bâtir,,,34,1.052272,44.448117
2021-807421,2021-02-25,000001,Vente,205000,5317,F,LA PIECE LONGUE,B249,46700,46187,Mauroux,46,,,461870000F0658,,,,,,,,,,,,,0,3,Dépendance,,0,S,sols,,,500,1.051982,44.449444
2021-807421,2021-02-25,000001,Vente,205000,5317,F,LA PIECE LONGUE,B249,46700,46187,Mauroux,46,,,461870000F0658,,,,,,,,,,,,,0,3,Dépendance,,0,S,sols,,,500,1.051982,44.449444
2021-807421,2021-02-25,000001,Vente,205000,5317,F,LA PIECE LONGUE,B249,46700,46187,Mauroux,46,,,461870000F0658,,,,,,,,,,,,,0,3,Dépendance,,0,S,sols,,,500,1.051982,44.449444
2021-807421,2021-02-25,000001,Vente,205000,5317,F,LA PIECE LONGUE,B249,46700,46187,Mauroux,46,,,461870000F0658,,,,,,,,,,,,,0,3,Dépendance,,0,S,sols,,,500,1.051982,44.449444
2021-807421,2021-02-25,000001,Vente,205000,5317,F,LA PIECE LONGUE,B249,46700,46187,Mauroux,46,,,461870000F0658,,,,,,,,,,,,,0,1,Maison,169,5,S,sols,,,500,1.051982,44.449444
2021-807421,2021-02-25,000001,Vente,205000,5317,F,LA PIECE LONGUE,B249,46700,46187,Mauroux,46,,,461870000F0658,,,,,,,,,,,,,0,3,Dépendance,,0,T,terres,,,1029,1.051982,44.449444
2021-807421,2021-02-25,000001,Vente,205000,5317,F,LA PIECE LONGUE,B249,46700,46187,Mauroux,46,,,461870000F0658,,,,,,,,,,,,,0,3,Dépendance,,0,T,terres,,,1029,1.051982,44.449444
2021-807421,2021-02-25,000001,Vente,205000,5317,F,LA PIECE LONGUE,B249,46700,46187,Mauroux,46,,,461870000F0658,,,,,,,,,,,,,0,3,Dépendance,,0,T,terres,,,1029,1.051982,44.449444
2021-807421,2021-02-25,000001,Vente,205000,5317,F,LA PIECE LONGUE,B249,46700,46187,Mauroux,46,,,461870000F0658,,,,,,,,,,,,,0,3,Dépendance,,0,T,terres,,,1029,1.051982,44.449444
2021-807421,2021-02-25,000001,Vente,205000,5317,F,LA PIECE LONGUE,B249,46700,46187,Mauroux,46,,,461870000F0658,,,,,,,,,,,,,0,1,Maison,169,5,T,terres,,,1029,1.051982,44.449444
2021-807421,2021-02-25,000001,Vente,205000,5317,F,LA PIECE LONGUE,B249,46700,46187,Mauroux,46,,,461870000F0658,,,,,,,,,,,,,0,3,Dépendance,,0,T,terres,,,1529,1.051982,44.449444
2021-807421,2021-02-25,000001,Vente,205000,5317,F,LA PIECE LONGUE,B249,46700,46187,Mauroux,46,,,461870000F0658,,,,,,,,,,,,,0,3,Dépendance,,0,T,terres,,,1529,1.051982,44.449444
2021-807421,2021-02-25,000001,Vente,205000,5317,F,LA PIECE LONGUE,B249,46700,46187,Mauroux,46,,,461870000F0658,,,,,,,,,,,,,0,3,Dépendance,,0,T,terres,,,1529,1.051982,44.449444
2021-807421,2021-02-25,000001,Vente,205000,5317,F,LA PIECE LONGUE,B249,46700,46187,Mauroux,46,,,461870000F0658,,,,,,,,,,,,,0,3,Dépendance,,0,T,terres,,,1529,1.051982,44.449444
2021-807421,2021-02-25,000001,Vente,205000,5317,F,LA PIECE LONGUE,B249,46700,46187,Mauroux,46,,,461870000F0658,,,,,,,,,,,,,0,1,Maison,169,5,T,terres,,,1529,1.051982,44.449444
2021-807538,2021-03-05,000001,Vente,38200,,,LA NAUZE D AGIS,B229,46700,46187,Mauroux,46,,,461870000D0454,,,,,,,,,,,,,0,,,,,T,terres,,,11745,1.048228,44.432795
2021-807538,2021-03-05,000001,Vente,38200,,,LA NAUZE D AGIS,B229,46700,46187,Mauroux,46,,,461870000D0455,,,,,,,,,,,,,0,,,,,P,prés,,,3363,1.04972,44.431221
2021-807538,2021-03-05,000001,Vente,38200,,,LA NAUZE D AGIS,B229,46700,46187,Mauroux,46,,,461870000D0455,,,,,,,,,,,,,0,,,,,P,prés,,,6722,1.04972,44.431221
2021-807538,2021-03-05,000001,Vente,38200,,,LA NAUZE D AGIS,B229,46700,46187,Mauroux,46,,,461870000D0456,,,,,,,,,,,,,0,,,,,P,prés,,,2510,1.050696,44.431448
2021-807538,2021-03-05,000001,Vente,38200,,,LA NAUZE D AGIS,B229,46700,46187,Mauroux,46,,,461870000D0457,,,,,,,,,,,,,0,,,,,T,terres,,,990,1.051233,44.431082
2021-807538,2021-03-05,000001,Vente,38200,,,LA NAUZE D AGIS,B229,46700,46187,Mauroux,46,,,461870000D0458,,,,,,,,,,,,,0,,,,,P,prés,,,11060,1.050694,44.430369
2021-807538,2021-03-05,000001,Vente,38200,,,LA NAUZE D AGIS,B229,46700,46187,Mauroux,46,,,461870000D0459,,,,,,,,,,,,,0,,,,,T,terres,,,5035,1.048929,44.429971
2021-807538,2021-03-05,000001,Vente,38200,,,LA NAUZE D AGIS,B229,46700,46187,Mauroux,46,,,461870000D0459,,,,,,,,,,,,,0,,,,,VI,vignes,,,2624,1.048929,44.429971
2021-807538,2021-03-05,000001,Vente,38200,,,LA NAUZE D AGIS,B229,46700,46187,Mauroux,46,,,461870000D0459,,,,,,,,,,,,,0,,,,,T,terres,,,5035,1.048929,44.429971
2021-807538,2021-03-05,000001,Vente,38200,,,LA NAUZE D AGIS,B229,46700,46187,Mauroux,46,,,461870000D0459,,,,,,,,,,,,,0,,,,,T,terres,,,5036,1.048929,44.429971
2021-807538,2021-03-05,000001,Vente,38200,,,LA NAUZE D AGIS,B229,46700,46187,Mauroux,46,,,461870000D0460,,,,,,,,,,,,,0,,,,,T,terres,,,22192,1.048067,44.431367
2021-807538,2021-03-05,000001,Vente,38200,,,LA NAUZE D AGIS,B229,46700,46187,Mauroux,46,,,461870000D0460,,,,,,,,,,,,,0,,,,,T,terres,,,22193,1.048067,44.431367
2021-807642,2021-03-18,000001,Vente,50,,,BONNEMAISON,B018,46700,46187,Mauroux,46,,,461870000A1164,,,,,,,,,,,,,0,,,,,S,sols,,,101,1.026917,44.459389
2021-808419,2021-05-05,000001,Vente,23000,5114,F,REYNOU ET CLOS DEL CAPRE,B358,46700,46187,Mauroux,46,,,461870000C0114,,,65,55.5,,,,,,,,,1,4,Local industriel. commercial ou assimilé,60,0,,,,,,1.062267,44.451554
2021-808489,2021-05-12,000001,Vente,54200,5114,F,REYNOU ET CLOS DEL CAPRE,B358,46700,46187,Mauroux,46,,,461870000C0114,,,28,60.36,,,,,,,,,1,4,Local industriel. commercial ou assimilé,61,0,,,,,,1.062267,44.451554
2021-808980,2021-06-28,000001,Vente,106470,5189,F,FONTAINE DE SABY,B149,46700,46187,Mauroux,46,,,461870000A1189,,,,,,,,,,,,,0,4,Local industriel. commercial ou assimilé,75,0,S,sols,,,445,1.029485,44.460919
2021-808980,2021-06-28,000001,Vente,106470,,,FONTAINE DE SABY,B149,46700,46187,Mauroux,46,,,461870000A1201,,,,,,,,,,,,,0,,,,,S,sols,,,2,1.02931,44.460916
2021-808980,2021-06-28,000001,Vente,106470,,,FONTAINE DE SABY,B149,46700,46187,Mauroux,46,,,461870000A1206,,,,,,,,,,,,,0,,,,,S,sols,,,46,1.029586,44.460864
2021-808995,2021-06-11,000001,Vente,6000,,,COMBE DE TRAPAS,B111,46700,46187,Mauroux,46,,,461870000E0515,,,,,,,,,,,,,0,,,,,T,terres,,,1105,1.021218,44.445069
2021-808995,2021-06-11,000001,Vente,6000,,,COMBE DE TRAPAS,B111,46700,46187,Mauroux,46,,,461870000E0516,,,,,,,,,,,,,0,,,,,BS,taillis sous futaie,,,3465,1.021539,44.445425
2021-808995,2021-06-11,000001,Vente,6000,,,COMBE DE TRAPAS,B111,46700,46187,Mauroux,46,,,461870000E0517,,,,,,,,,,,,,0,,,,,L,landes,,,6685,1.022092,44.445683
2021-808995,2021-06-11,000001,Vente,6000,,,COMBE DE TRAPAS,B111,46700,46187,Mauroux,46,,,461870000E0518,,,,,,,,,,,,,0,,,,,T,terres,,,4623,1.022035,44.446005
2021-808995,2021-06-11,000001,Vente,6000,,,COMBE DE TRAPAS,B111,46700,46187,Mauroux,46,,,461870000E0518,,,,,,,,,,,,,0,,,,,T,terres,,,4622,1.022035,44.446005
2021-808995,2021-06-11,000001,Vente,6000,,,LAFONT,B195,46700,46187,Mauroux,46,,,461870000E0547,,,,,,,,,,,,,0,,,,,L,landes,,,3815,1.022834,44.448744
2021-808995,2021-06-11,000001,Vente,6000,,,LAFONT,B195,46700,46187,Mauroux,46,,,461870000E0548,,,,,,,,,,,,,0,,,,,P,prés,,,1020,1.022079,44.449071
2021-809130,2021-06-21,000001,Vente,287990,5222,F,DORDE,B133,46700,46187,Mauroux,46,,,461870000D0291,,,,,,,,,,,,,0,1,Maison,124,5,S,sols,,,500,1.050431,44.43911
2021-809130,2021-06-21,000001,Vente,287990,5222,F,DORDE,B133,46700,46187,Mauroux,46,,,461870000D0291,,,,,,,,,,,,,0,1,Maison,124,5,T,terres,,,2520,1.050431,44.43911
2021-809130,2021-06-21,000001,Vente,287990,5222,F,DORDE,B133,46700,46187,Mauroux,46,,,461870000D0291,,,,,,,,,,,,,0,1,Maison,55,0,T,terres,,,2520,1.050431,44.43911
2021-809130,2021-06-21,000001,Vente,287990,5222,F,DORDE,B133,46700,46187,Mauroux,46,,,461870000D0291,,,,,,,,,,,,,0,3,Dépendance,,0,T,terres,,,2520,1.050431,44.43911
2021-809130,2021-06-21,000001,Vente,287990,5222,F,DORDE,B133,46700,46187,Mauroux,46,,,461870000D0291,,,,,,,,,,,,,0,1,Maison,124,5,T,terres,,,3020,1.050431,44.43911
2021-809130,2021-06-21,000001,Vente,287990,5222,F,DORDE,B133,46700,46187,Mauroux,46,,,461870000D0291,,,,,,,,,,,,,0,1,Maison,55,0,T,terres,,,3020,1.050431,44.43911
2021-809130,2021-06-21,000001,Vente,287990,5222,F,DORDE,B133,46700,46187,Mauroux,46,,,461870000D0291,,,,,,,,,,,,,0,3,Dépendance,,0,S,sols,,,500,1.050431,44.43911
2021-809130,2021-06-21,000001,Vente,287990,5222,F,DORDE,B133,46700,46187,Mauroux,46,,,461870000D0291,,,,,,,,,,,,,0,1,Maison,55,0,S,sols,,,500,1.050431,44.43911
2021-809130,2021-06-21,000001,Vente,287990,5222,F,DORDE,B133,46700,46187,Mauroux,46,,,461870000D0291,,,,,,,,,,,,,0,3,Dépendance,,0,T,terres,,,3020,1.050431,44.43911
2021-809130,2021-06-21,000001,Vente,287990,,,DORDE,B133,46700,46187,Mauroux,46,,,461870000D0293,,,,,,,,,,,,,0,,,,,T,terres,,,1720,1.05101,44.438618
2021-809396,2021-06-30,000001,Vente,63500,5114,F,REYNOU ET CLOS DEL CAPRE,B358,46700,46187,Mauroux,46,,,461870000C0114,,,34,60,,,,,,,,,1,4,Local industriel. commercial ou assimilé,61,0,,,,,,1.062267,44.451554
2021-809398,2021-06-17,000001,Vente,220000,,,TRUSSAL,B328,46700,46187,Mauroux,46,,,461870000F0847,,,,,,,,,,,,,0,,,,,P,prés,,,6313,1.048511,44.453419
2021-809398,2021-06-17,000001,Vente,220000,5242,F,TRUSSAL,B328,46700,46187,Mauroux,46,,,461870000F0849,,,,,,,,,,,,,0,1,Maison,126,4,S,sols,,,1000,1.049185,44.454065
2021-809398,2021-06-17,000001,Vente,220000,5242,F,TRUSSAL,B328,46700,46187,Mauroux,46,,,461870000F0849,,,,,,,,,,,,,0,3,Dépendance,,0,T,terres,,,9610,1.049185,44.454065
2021-809398,2021-06-17,000001,Vente,220000,5242,F,TRUSSAL,B328,46700,46187,Mauroux,46,,,461870000F0849,,,,,,,,,,,,,0,1,Maison,126,4,T,terres,,,9610,1.049185,44.454065
2021-809398,2021-06-17,000001,Vente,220000,5242,F,TRUSSAL,B328,46700,46187,Mauroux,46,,,461870000F0849,,,,,,,,,,,,,0,3,Dépendance,,0,S,sols,,,1000,1.049185,44.454065
2021-809798,2021-04-21,000002,Vente,5000,,,LE CLOS DE CHIOZE,B090,46700,46187,Mauroux,46,,,461870000A1230,,,,,,,,,,,,,0,,,,,T,terres,,,120,1.034726,44.466475
2021-809798,2021-04-21,000002,Vente,5000,,,LE CLOS DE CHIOZE,B090,46700,46187,Mauroux,46,,,461870000A1232,,,,,,,,,,,,,0,,,,,T,terres,,,90,1.034673,44.466439
2021-809827,2021-07-16,000001,Vente,240900,,,LA COMBE DE MORTAYROUX,B109,46700,46187,Mauroux,46,,,461870000E0417,,,,,,,,,,,,,0,,,,,S,sols,,,235,1.026712,44.448886
2021-809827,2021-07-16,000001,Vente,240900,5091,,LA COMBE DE MORTAYROUX,B109,46700,46187,Mauroux,46,,,461870000E0418,,,,,,,,,,,,,0,3,Dépendance,,0,S,sols,,,630,1.026524,44.448809
2021-809827,2021-07-16,000001,Vente,240900,5091,,LA COMBE DE MORTAYROUX,B109,46700,46187,Mauroux,46,,,461870000E0418,,,,,,,,,,,,,0,1,Maison,67,4,S,sols,,,630,1.026524,44.448809
2021-809827,2021-07-16,000001,Vente,240900,,,LA COMBE DE MORTAYROUX,B109,46700,46187,Mauroux,46,,,461870000E0419,,,,,,,,,,,,,0,,,,,J,jardins,POTAG,Jardin potager,690,1.026201,44.448904
2021-809827,2021-07-16,000001,Vente,240900,,,LA COMBE DE MORTAYROUX,B109,46700,46187,Mauroux,46,,,461870000E0421,,,,,,,,,,,,,0,,,,,J,jardins,POTAG,Jardin potager,590,1.026736,44.448577
2021-809827,2021-07-16,000001,Vente,240900,,,LA COMBE DE MORTAYROUX,B109,46700,46187,Mauroux,46,,,461870000E1020,,,,,,,,,,,,,0,,,,,P,prés,,,154,1.026516,44.44894
2021-809827,2021-07-16,000001,Vente,240900,,,LA COMBE DE MORTAYROUX,B109,46700,46187,Mauroux,46,,,461870000E1085,,,,,,,,,,,,,0,,,,,L,landes,,,167,1.026527,44.44871
2021-809829,2021-07-23,000001,Vente,178550,,,PECHAUSSOU,B242,46700,46187,Mauroux,46,,,461870000B0124,,,,,,,,,,,,,0,,,,,BS,taillis sous futaie,,,1040,1.04863,44.472113
2021-809829,2021-07-23,000001,Vente,178550,5123,F,PECHAUSSOU,B242,46700,46187,Mauroux,46,,,461870000B0555,,,,,,,,,,,,,0,1,Maison,104,5,T,terres,,,1607,1.049701,44.471689
2021-809829,2021-07-23,000001,Vente,178550,5123,F,PECHAUSSOU,B242,46700,46187,Mauroux,46,,,461870000B0555,,,,,,,,,,,,,0,1,Maison,104,5,S,sols,,,500,1.049701,44.471689
2021-809829,2021-07-23,000001,Vente,178550,5123,F,PECHAUSSOU,B242,46700,46187,Mauroux,46,,,461870000B0555,,,,,,,,,,,,,0,1,Maison,104,5,T,terres,,,4277,1.049701,44.471689
2021-809974,2021-05-16,000001,Vente,155000,,,MAUROUX,B220,46700,46187,Mauroux,46,,,461870000F0845,,2,,,,,,,,,,,0,,,,,,,,,,1.048191,44.454688
2021-809974,2021-05-16,000001,Vente,155000,,,MAUROUX,B220,46700,46187,Mauroux,46,,,461870000F0846,,,,,,,,,,,,,0,,,,,S,sols,,,826,1.048163,44.454772
2021-810608,2021-09-09,000002,Vente,4120,,,LAS BIENS ET LA SEGUE,B199,46700,46187,Mauroux,46,,,461870000E1185,,,,,,,,,,,,,0,,,,,VI,vignes,VAOC,Vins d'appellation d'origine contrôlée,134,1.028554,44.453728
2021-810646,2021-09-09,000001,Vente,187300,5192,,CLOS DE SABATIE,B102,46700,46187,Mauroux,46,,,461870000C0001,,,,,,,,,,,,,0,1,Maison,75,4,T,terres,,,2835,1.061443,44.463048
2021-810646,2021-09-09,000001,Vente,187300,5192,,CLOS DE SABATIE,B102,46700,46187,Mauroux,46,,,461870000C0001,,,,,,,,,,,,,0,3,Dépendance,,0,S,sols,,,500,1.061443,44.463048
2021-810646,2021-09-09,000001,Vente,187300,5192,,CLOS DE SABATIE,B102,46700,46187,Mauroux,46,,,461870000C0001,,,,,,,,,,,,,0,1,Maison,75,4,S,sols,,,500,1.061443,44.463048
2021-810646,2021-09-09,000001,Vente,187300,5192,,CLOS DE SABATIE,B102,46700,46187,Mauroux,46,,,461870000C0001,,,,,,,,,,,,,0,3,Dépendance,,0,T,terres,,,2835,1.061443,44.463048
2021-810646,2021-09-09,000001,Vente,187300,,,CLOS DE SABATIE,B102,46700,46187,Mauroux,46,,,461870000C0398,,,,,,,,,,,,,0,,,,,S,sols,,,584,1.061278,44.462874
2021-810646,2021-09-09,000001,Vente,187300,,,CLOS DE SABATIE,B102,46700,46187,Mauroux,46,,,461870000C0399,,,,,,,,,,,,,0,,,,,T,terres,,,2111,1.061084,44.462779
2021-811079,2021-10-01,000001,Vente,1000,,,CHAMPS DE RAUST,B074,46700,46187,Mauroux,46,,,461870000B0310,,,,,,,,,,,,,0,,,,,T,terres,,,2645,1.054054,44.466345
2021-811274,2021-10-13,000001,Vente,64500,5114,F,REYNOU ET CLOS DEL CAPRE,B358,46700,46187,Mauroux,46,,,461870000C0114,,,53,54.4,,,,,,,,,1,4,Local industriel. commercial ou assimilé,55,0,,,,,,1.062267,44.451554
2021-811695,2021-11-05,000001,Vente,18000,,,TRUSSAL ET PRIEUR,B330,46700,46187,Mauroux,46,,,461870000F0535,,,,,,,,,,,,,0,,,,,T,terres,,,1332,1.049339,44.450403
2021-812156,2021-11-24,000001,Vente,245700,,,LAVAYSSE,B206,46700,46187,Mauroux,46,,,461870000E0331,,,,,,,,,,,,,0,,,,,T,terres,,,1220,1.027731,44.4569
2021-812156,2021-11-24,000001,Vente,245700,,,LAVAYSSE,B206,46700,46187,Mauroux,46,,,461870000E0332,,,,,,,,,,,,,0,,,,,BS,taillis sous futaie,,,240,1.027675,44.457267
2021-812156,2021-11-24,000001,Vente,245700,,,LAVAYSSE,B206,46700,46187,Mauroux,46,,,461870000E0333,,,,,,,,,,,,,0,,,,,BS,taillis sous futaie,,,350,1.027986,44.457259
2021-812156,2021-11-24,000001,Vente,245700,,,LAVAYSSE,B206,46700,46187,Mauroux,46,,,461870000E0336,,,,,,,,,,,,,0,,,,,PA,pâtures,,,2240,1.028333,44.457267
2021-812156,2021-11-24,000001,Vente,245700,5345,F,LAVAYSSE,B206,46700,46187,Mauroux,46,,,461870000E0345,,,,,,,,,,,,,0,1,Maison,156,2,S,sols,,,445,1.028279,44.456712
2021-812156,2021-11-24,000001,Vente,245700,5345,F,LAVAYSSE,B206,46700,46187,Mauroux,46,,,461870000E0345,,,,,,,,,,,,,0,1,Maison,156,2,PA,pâtures,,,10000,1.028279,44.456712
2021-812156,2021-11-24,000001,Vente,245700,,,LAVAYSSE,B206,46700,46187,Mauroux,46,,,461870000E0347,,,,,,,,,,,,,0,,,,,T,terres,,,570,1.028342,44.455847
2021-812211,2021-11-30,000001,Vente,95500,5025,,PECHAUSSOU,B242,46700,46187,Mauroux,46,,,461870000B0121,,,,,,,,,,,,,0,3,Dépendance,,0,J,jardins,POTAG,Jardin potager,1150,1.049257,44.470807
2021-812211,2021-11-30,000001,Vente,95500,5025,,PECHAUSSOU,B242,46700,46187,Mauroux,46,,,461870000B0121,,,,,,,,,,,,,0,1,Maison,70,4,S,sols,,,500,1.049257,44.470807
2021-812211,2021-11-30,000001,Vente,95500,5025,,PECHAUSSOU,B242,46700,46187,Mauroux,46,,,461870000B0121,,,,,,,,,,,,,0,3,Dépendance,,0,S,sols,,,500,1.049257,44.470807
2021-812211,2021-11-30,000001,Vente,95500,5025,,PECHAUSSOU,B242,46700,46187,Mauroux,46,,,461870000B0121,,,,,,,,,,,,,0,1,Maison,70,4,J,jardins,POTAG,Jardin potager,1150,1.049257,44.470807
2021-812235,2021-12-07,000001,Vente,30000,,,LES TROIS NOYERS,B325,46700,46187,Mauroux,46,,,461870000F0734,,,,,,,,,,,,,0,,,,,AB,terrains a bâtir,,,881,1.051741,44.447973
2021-812235,2021-12-07,000001,Vente,30000,,,LES TROIS NOYERS,B325,46700,46187,Mauroux,46,,,461870000F0740,,,,,,,,,,,,,0,,,,,AB,terrains a bâtir,,,8,1.051606,44.447355
2021-812235,2021-12-07,000001,Vente,30000,,,CHAMP DE FABRE,B071,46700,46187,Mauroux,46,,,461870000F0781,,,,,,,,,,,,,0,,,,,AB,terrains a bâtir,,,957,1.051334,44.447566
2021-812235,2021-12-07,000001,Vente,30000,,,CHAMP DE FABRE,B071,46700,46187,Mauroux,46,,,461870000F0782,,,,,,,,,,,,,0,,,,,AB,terrains a bâtir,,,1153,1.05127,44.447782
2021-812235,2021-12-07,000001,Vente,30000,,,CHAMP DE FABRE,B071,46700,46187,Mauroux,46,,,461870000F0789,,,,,,,,,,,,,0,,,,,AB,terrains a bâtir,,,430,1.051461,44.447368
2021-812235,2021-12-07,000001,Vente,30000,,,LES TROIS NOYERS,B325,46700,46187,Mauroux,46,,,461870000F0823,,,,,,,,,,,,,0,,,,,AB,terrains a bâtir,,,1,1.051874,44.447894
2021-812235,2021-12-07,000001,Vente,30000,,,LES TROIS NOYERS,B325,46700,46187,Mauroux,46,,,461870000F0824,,,,,,,,,,,,,0,,,,,AB,terrains a bâtir,,,43,1.051615,44.447512
2021-812284,2021-12-03,000001,Vente,591050,,,LE VERT,B343,46700,46187,Mauroux,46,,,461870000C0185,,,,,,,,,,,,,0,,,,,P,prés,,,8285,1.054524,44.458464
2021-812284,2021-12-03,000001,Vente,591050,,,LE VERT,B343,46700,46187,Mauroux,46,,,461870000C0185,,,,,,,,,,,,,0,,,,,S,sols,,,100,1.054524,44.458464
2021-812284,2021-12-03,000001,Vente,591050,,,LE VERT,B343,46700,46187,Mauroux,46,,,461870000C0353,,,,,,,,,,,,,0,,,,,L,landes,,,335,1.054444,44.459038
2021-812284,2021-12-03,000001,Vente,591050,5102,,LE VERT,B343,46700,46187,Mauroux,46,,,461870000C0432,,,,,,,,,,,,,0,4,Local industriel. commercial ou assimilé,222,0,S,sols,,,1097,1.05466,44.458695
2021-812284,2021-12-03,000001,Vente,591050,5102,,LE VERT,B343,46700,46187,Mauroux,46,,,461870000C0432,,,,,,,,,,,,,0,4,Local industriel. commercial ou assimilé,374,0,S,sols,,,1097,1.05466,44.458695
2021-812285,2021-11-29,000001,Vente,186000,5124,F,MAUROUX,B220,46700,46187,Mauroux,46,,,461870000F0732,,,,,,,,,,,,,0,4,Local industriel. commercial ou assimilé,42,0,S,sols,,,287,1.046351,44.454712
2021-812285,2021-11-29,000001,Vente,186000,5124,F,MAUROUX,B220,46700,46187,Mauroux,46,,,461870000F0732,,,,,,,,,,,,,0,1,Maison,158,5,S,sols,,,287,1.046351,44.454712
2021-812300,2021-12-14,000002,Vente,4911.5,,,LES VIGNASSES ET LES LAQUE,B349,46700,46187,Mauroux,46,,,461870000D0519,,,,,,,,,,,,,0,,,,,BS,taillis sous futaie,,,2705,1.04901,44.439685
2021-812300,2021-12-14,000002,Vente,4911.5,,,PIECES DE CAMET,B251,46700,46187,Mauroux,46,,,461870000D0531,,,,,,,,,,,,,0,,,,,T,terres,,,6736,1.049322,44.440369
2021-812300,2021-12-14,000002,Vente,4911.5,,,PIECES DE CAMET,B251,46700,46187,Mauroux,46,,,461870000D0531,,,,,,,,,,,,,0,,,,,T,terres,,,13474,1.049322,44.440369
2021-812300,2021-12-14,000002,Vente,4911.5,,,PIECES DE CAMET,B251,46700,46187,Mauroux,46,,,461870000D0568,,,,,,,,,,,,,0,,,,,T,terres,,,985,1.048878,44.441728