id_mutation,date_mutation,numero_disposition,nature_mutation,valeur_fonciere,adresse_numero,adresse_suffixe,adresse_nom_voie,adresse_code_voie,code_postal,code_commune,nom_commune,code_departement,ancien_code_commune,ancien_nom_commune,id_parcelle,ancien_id_parcelle,numero_volume,lot1_numero,lot1_surface_carrez,lot2_numero,lot2_surface_carrez,lot3_numero,lot3_surface_carrez,lot4_numero,lot4_surface_carrez,lot5_numero,lot5_surface_carrez,nombre_lots,code_type_local,type_local,surface_reelle_bati,nombre_pieces_principales,code_nature_culture,nature_culture,code_nature_culture_speciale,nature_culture_speciale,surface_terrain,longitude,latitude
2021-808210,2021-04-14,000001,Vente,229100,,,LES PAYSSES,B033,46210,46269,Saint-Hilaire,46,,,462690000A0063,,,,,,,,,,,,,0,,,,,P,prés,,,6660,2.124055,44.807211
2021-808210,2021-04-14,000001,Vente,229100,,,LES PAYSSES,B033,46210,46269,Saint-Hilaire,46,,,462690000A0064,,,,,,,,,,,,,0,,,,,T,terres,,,14296,2.124371,44.807552
2021-808210,2021-04-14,000001,Vente,229100,,,LES PAYSSES,B033,46210,46269,Saint-Hilaire,46,,,462690000A0065,,,,,,,,,,,,,0,,,,,S,sols,,,24,2.124321,44.808063
2021-808210,2021-04-14,000001,Vente,229100,,,LES ROUSTIES,B041,46210,46269,Saint-Hilaire,46,,,462690000A0237,,,,,,,,,,,,,0,,,,,P,prés,,,12350,2.137594,44.793514
2021-808511,2021-05-11,000001,Vente,42000,,,LES ROUSTIES,B041,46210,46269,Saint-Hilaire,46,,,462690000A0164,,,,,,,,,,,,,0,,,,,L,landes,,,36,2.131006,44.793382
2021-808511,2021-05-11,000001,Vente,42000,,,LES ROUSTIES,B041,46210,46269,Saint-Hilaire,46,,,462690000A0165,,,,,,,,,,,,,0,,,,,L,landes,,,315,2.130781,44.793491
2021-808511,2021-05-11,000001,Vente,42000,5050,,LES ROUSTIES,B041,46210,46269,Saint-Hilaire,46,,,462690000A0208,,,,,,,,,,,,,0,1,Maison,35,1,S,sols,,,590,2.130759,44.793352
2021-808511,2021-05-11,000001,Vente,42000,,,LES ROUSTIES,B041,46210,46269,Saint-Hilaire,46,,,462690000A0209,,,,,,,,,,,,,0,,,,,J,jardins,POTAG,Jardin potager,930,2.130817,44.793091
2021-808511,2021-05-11,000001,Vente,42000,,,LES ROUSTIES,B041,46210,46269,Saint-Hilaire,46,,,462690000A0210,,,,,,,,,,,,,0,,,,,PA,pâtures,PATUR,Pâture plantée,280,2.13059,44.793182
2021-808511,2021-05-11,000001,Vente,42000,,,LES ROUSTIES,B041,46210,46269,Saint-Hilaire,46,,,462690000A0228,,,,,,,,,,,,,0,,,,,T,terres,,,2775,2.132607,44.793275
2021-808511,2021-05-11,000001,Vente,42000,,,LES ROUSTIES,B041,46210,46269,Saint-Hilaire,46,,,462690000A0231,,,,,,,,,,,,,0,,,,,BS,taillis sous futaie,,,3575,2.134195,44.792517
2021-809309,2021-06-29,000001,Vente,8700,,,LES ROUSTIES,B041,46210,46269,Saint-Hilaire,46,,,462690000A0138,,,,,,,,,,,,,0,,,,,BS,taillis sous futaie,,,4215,2.133658,44.795219
2021-809309,2021-06-29,000001,Vente,8700,,,LES ROUSTIES,B041,46210,46269,Saint-Hilaire,46,,,462690000A0139,,,,,,,,,,,,,0,,,,,BT,taillis simples,,,6355,2.132402,44.794326
2021-809309,2021-06-29,000001,Vente,8700,,,LES ROUSTIES,B041,46210,46269,Saint-Hilaire,46,,,462690000A0229,,,,,,,,,,,,,0,,,,,T,terres,,,4985,2.133247,44.793415
2021-809309,2021-06-29,000001,Vente,8700,,,LES ROUSTIES,B041,46210,46269,Saint-Hilaire,46,,,462690000A0230,,,,,,,,,,,,,0,,,,,BS,taillis sous futaie,,,3380,2.133208,44.792922
2021-809309,2021-06-29,000001,Vente,8700,,,LA DAME,B016,46210,46269,Saint-Hilaire,46,,,462690000A0348,,,,,,,,,,,,,0,,,,,BS,taillis sous futaie,,,7135,2.131987,44.788975
