id_mutation,date_mutation,numero_disposition,nature_mutation,valeur_fonciere,adresse_numero,adresse_suffixe,adresse_nom_voie,adresse_code_voie,code_postal,code_commune,nom_commune,code_departement,ancien_code_commune,ancien_nom_commune,id_parcelle,ancien_id_parcelle,numero_volume,lot1_numero,lot1_surface_carrez,lot2_numero,lot2_surface_carrez,lot3_numero,lot3_surface_carrez,lot4_numero,lot4_surface_carrez,lot5_numero,lot5_surface_carrez,nombre_lots,code_type_local,type_local,surface_reelle_bati,nombre_pieces_principales,code_nature_culture,nature_culture,code_nature_culture_speciale,nature_culture_speciale,surface_terrain,longitude,latitude
2021-806766,2021-01-29,000001,Vente,220510,271,,RTE BELLEVUE,0040,46270,46272,Saint-Jean-Mirabel,46,,,462720000A0966,,,,,,,,,,,,,0,1,Maison,170,7,S,sols,,,1000,2.097749,44.6388
2021-806766,2021-01-29,000001,Vente,220510,271,,RTE BELLEVUE,0040,46270,46272,Saint-Jean-Mirabel,46,,,462720000A0966,,,,,,,,,,,,,0,1,Maison,170,7,P,prés,,,1615,2.097749,44.6388
2021-806766,2021-01-29,000001,Vente,220510,271,,RTE BELLEVUE,0040,46270,46272,Saint-Jean-Mirabel,46,,,462720000A0966,,,,,,,,,,,,,0,1,Maison,75,2,P,prés,,,1615,2.097749,44.6388
2021-806766,2021-01-29,000001,Vente,220510,271,,RTE BELLEVUE,0040,46270,46272,Saint-Jean-Mirabel,46,,,462720000A0966,,,,,,,,,,,,,0,1,Maison,75,2,S,sols,,,1000,2.097749,44.6388
2021-806766,2021-01-29,000001,Vente,220510,,,LES AUBRISQUIES,B002,46270,46272,Saint-Jean-Mirabel,46,,,462720000A1026,,,,,,,,,,,,,0,,,,,T,terres,,,1213,2.097434,44.639118
2021-806774,2021-01-27,000001,Vente,190000,753,,RTE DES MONTS,0048,46270,46272,Saint-Jean-Mirabel,46,,,462720000B1132,,,,,,,,,,,,,0,3,Dépendance,,0,S,sols,,,2191,2.085358,44.618452
2021-806774,2021-01-27,000001,Vente,190000,753,,RTE DES MONTS,0048,46270,46272,Saint-Jean-Mirabel,46,,,462720000B1132,,,,,,,,,,,,,0,1,Maison,153,5,S,sols,,,2191,2.085358,44.618452
2021-806774,2021-01-27,000001,Vente,190000,,,ENCANAYRALS,B022,46270,46272,Saint-Jean-Mirabel,46,,,462720000B1134,,,,,,,,,,,,,0,,,,,L,landes,PACAG,Pacage,108,2.085157,44.618473
2021-806774,2021-01-27,000001,Vente,190000,,,ENCANAYRALS,B022,46270,46272,Saint-Jean-Mirabel,46,,,462720000B1383,,,,,,,,,,,,,0,,,,,L,landes,,,168,2.085591,44.618142
2021-808339,2021-05-11,000002,Vente,34000,,,ENCANAYRALS,B022,46270,46272,Saint-Jean-Mirabel,46,,,462720000B1633,,,,,,,,,,,,,0,,,,,P,prés,,,2127,2.085896,44.617566
2021-808339,2021-05-11,000002,Vente,34000,,,ENCANAYRALS,B022,46270,46272,Saint-Jean-Mirabel,46,,,462720000B1634,,,,,,,,,,,,,0,,,,,P,prés,,,2084,2.085687,44.617958
2021-808339,2021-05-11,000002,Vente,34000,,,ENCANAYRALS,B022,46270,46272,Saint-Jean-Mirabel,46,,,462720000B1635,,,,,,,,,,,,,0,,,,,P,prés,,,8,2.085449,44.617623
2021-808339,2021-05-11,000002,Vente,34000,,,ENCANAYRALS,B022,46270,46272,Saint-Jean-Mirabel,46,,,462720000B1636,,,,,,,,,,,,,0,,,,,P,prés,,,5,2.085409,44.617894
2021-809631,2021-07-20,000001,Vente,135859.95,140,,CHEM DE POLICOU,0013,46270,46272,Saint-Jean-Mirabel,46,,,462720000A1063,,,,,,,,,,,,,0,1,Maison,30,1,T,terres,,,1288,2.100101,44.637338
2021-809631,2021-07-20,000001,Vente,135859.95,140,,CHEM DE POLICOU,0013,46270,46272,Saint-Jean-Mirabel,46,,,462720000A1063,,,,,,,,,,,,,0,1,Maison,30,1,S,sols,,,500,2.100101,44.637338
2021-809631,2021-07-20,000001,Vente,135859.95,,,LE POLICOU,B041,46270,46272,Saint-Jean-Mirabel,46,,,462720000A1121,,,,,,,,,,,,,0,,,,,T,terres,,,101,2.100464,44.637258
2021-811750,2021-11-09,000001,Vente,30,,,COMBE DE LA BARTE,B017,46270,46272,Saint-Jean-Mirabel,46,,,462720000B0853,,,,,,,,,,,,,0,,,,,L,landes,PACAG,Pacage,48,2.101425,44.625045
2021-811908,2021-11-22,000001,Vente,1900,,,LES BARTES,B003,46270,46272,Saint-Jean-Mirabel,46,,,462720000B0460,,,,,,,,,,,,,0,,,,,BT,taillis simples,,,17430,2.113263,44.634081
2021-811929,2021-11-22,000001,Vente,350,,,LES PARGADES,B037,46270,46272,Saint-Jean-Mirabel,46,,,462720000B0193,,,,,,,,,,,,,0,,,,,BF,futaies feuillues,,,1543,2.101144,44.625209
2021-811929,2021-11-22,000001,Vente,350,,,LES PARGADES,B037,46270,46272,Saint-Jean-Mirabel,46,,,462720000B0196,,,,,,,,,,,,,0,,,,,BF,futaies feuillues,,,2619,2.100885,44.625694
2021-812506,2021-12-16,000001,Vente,13000,,,PONT D ENGUIRANDE,B042,46270,46272,Saint-Jean-Mirabel,46,,,462720000B0902,,,,,,,,,,,,,0,,,,,P,prés,,,15695,2.130998,44.639462
2021-812506,2021-12-16,000001,Vente,13000,,,PONT D ENGUIRANDE,B042,46270,46272,Saint-Jean-Mirabel,46,,,462720000B0913,,,,,,,,,,,,,0,,,,,S,sols,,,30,2.132135,44.640032
2021-812506,2021-12-16,000001,Vente,13000,,,PONT D ENGUIRANDE,B042,46270,46272,Saint-Jean-Mirabel,46,,,462720000B0914,,,,,,,,,,,,,0,,,,,P,prés,,,6487,2.132428,44.640236
