id_mutation,date_mutation,numero_disposition,nature_mutation,valeur_fonciere,adresse_numero,adresse_suffixe,adresse_nom_voie,adresse_code_voie,code_postal,code_commune,nom_commune,code_departement,ancien_code_commune,ancien_nom_commune,id_parcelle,ancien_id_parcelle,numero_volume,lot1_numero,lot1_surface_carrez,lot2_numero,lot2_surface_carrez,lot3_numero,lot3_surface_carrez,lot4_numero,lot4_surface_carrez,lot5_numero,lot5_surface_carrez,nombre_lots,code_type_local,type_local,surface_reelle_bati,nombre_pieces_principales,code_nature_culture,nature_culture,code_nature_culture_speciale,nature_culture_speciale,surface_terrain,longitude,latitude
2021-814043,2021-03-23,000001,Vente,90000,32,,RUE NOMPAR DE CAUMONT,0028,47430,47061,Caumont-sur-Garonne,47,,,470610000B0354,,,,,,,,,,,,,0,1,Maison,229,9,S,sols,,,2125,0.180075,44.441248
2021-814043,2021-03-23,000001,Vente,90000,32,,RUE NOMPAR DE CAUMONT,0028,47430,47061,Caumont-sur-Garonne,47,,,470610000B0354,,,,,,,,,,,,,0,1,Maison,120,3,S,sols,,,2125,0.180075,44.441248
2021-814043,2021-03-23,000001,Vente,90000,32,,RUE NOMPAR DE CAUMONT,0028,47430,47061,Caumont-sur-Garonne,47,,,470610000B0354,,,,,,,,,,,,,0,3,Dépendance,,0,S,sols,,,2125,0.180075,44.441248
2021-814043,2021-03-23,000001,Vente,90000,49,A,LE BOURG,B011,47430,47061,Caumont-sur-Garonne,47,,,470610000B0355,,,,,,,,,,,,,0,3,Dépendance,,0,S,sols,,,40,0.180126,44.441106
2021-814043,2021-03-23,000001,Vente,90000,49,A,LE BOURG,B011,47430,47061,Caumont-sur-Garonne,47,,,470610000B0355,,,,,,,,,,,,,0,3,Dépendance,,0,S,sols,,,40,0.180126,44.441106
2021-814443,2021-04-19,000001,Vente,23500,,,VERDUTS,B077,47430,47061,Caumont-sur-Garonne,47,,,47061000ZC0250,,,,,,,,,,,,,0,,,,,AB,terrains a bâtir,,,1072,0.167414,44.42841
2021-815086,2021-05-04,000001,Vente,23500,,,VERDUTS,B077,47430,47061,Caumont-sur-Garonne,47,,,47061000ZC0248,,,,,,,,,,,,,0,,,,,AB,terrains a bâtir,,,1169,0.166474,44.427762
2021-815846,2021-06-15,000001,Vente,27560,,,BALOUX ET CAFFRES,B007,47430,47061,Caumont-sur-Garonne,47,,,47061000ZD0235,,,,,,,,,,,,,0,,,,,T,terres,,,26248,0.173562,44.441211
2021-815846,2021-06-15,000001,Vente,27560,,,BALOUX ET CAFFRES,B007,47430,47061,Caumont-sur-Garonne,47,,,47061000ZD0235,,,,,,,,,,,,,0,,,,,T,terres,,,13123,0.173562,44.441211
2021-815991,2021-06-26,000001,Vente,97000,,,LE BOURG,B011,47430,47061,Caumont-sur-Garonne,47,,,470610000B0294,,,,,,,,,,,,,0,,,,,L,landes,,,50,0.18053,44.4401
2021-815991,2021-06-26,000001,Vente,97000,,,LE BOURG,B011,47430,47061,Caumont-sur-Garonne,47,,,470610000B0295,,,,,,,,,,,,,0,,,,,S,sols,,,30,0.180534,44.440063
2021-815991,2021-06-26,000001,Vente,97000,49,,LE BOURG,B011,47430,47061,Caumont-sur-Garonne,47,,,470610000B0313,,,,,,,,,,,,,0,3,Dépendance,,0,S,sols,,,40,0.180205,44.439569
2021-815991,2021-06-26,000001,Vente,97000,2,,RUE BASSE,0006,47430,47061,Caumont-sur-Garonne,47,,,470610000B0329,,,,,,,,,,,,,0,1,Maison,87,4,S,sols,,,90,0.180757,44.440079
2021-815991,2021-06-26,000001,Vente,97000,1,,PL SAINT GERMAIN,0015,47430,47061,Caumont-sur-Garonne,47,,,470610000B0641,,,,,,,,,,,,,0,1,Maison,61,3,S,sols,,,25,0.18082,44.44009
2021-816026,2021-06-18,000001,Vente,340000,,,ANCIENNE VILLE,B003,47430,47061,Caumont-sur-Garonne,47,,,47061000ZD0341,,,,,,,,,,,,,0,,,,,AB,terrains a bâtir,,,1681,0.18553,44.436663
2021-816026,2021-06-18,000001,Vente,340000,9001,,ANCIENNE VILLE,B003,47430,47061,Caumont-sur-Garonne,47,,,47061000ZD0342,,,,,,,,,,,,,0,1,Maison,159,5,S,sols,,,500,0.185704,44.436915
2021-816026,2021-06-18,000001,Vente,340000,9001,,ANCIENNE VILLE,B003,47430,47061,Caumont-sur-Garonne,47,,,47061000ZD0342,,,,,,,,,,,,,0,1,Maison,159,5,AG,terrains d'agrément,,,799,0.185704,44.436915
2021-816026,2021-06-18,000001,Vente,340000,9001,,ANCIENNE VILLE,B003,47430,47061,Caumont-sur-Garonne,47,,,47061000ZD0342,,,,,,,,,,,,,0,3,Dépendance,,0,AG,terrains d'agrément,,,799,0.185704,44.436915
2021-816026,2021-06-18,000001,Vente,340000,9001,,ANCIENNE VILLE,B003,47430,47061,Caumont-sur-Garonne,47,,,47061000ZD0342,,,,,,,,,,,,,0,3,Dépendance,,0,S,sols,,,500,0.185704,44.436915
2021-816813,2021-07-02,000001,Vente,188000,5000,F,REJAUT,B063,47430,47061,Caumont-sur-Garonne,47,,,47061000ZK0165,,,,,,,,,,,,,0,1,Maison,90,4,AG,terrains d'agrément,,,867,0.169049,44.424693
2021-816813,2021-07-02,000001,Vente,188000,5000,F,REJAUT,B063,47430,47061,Caumont-sur-Garonne,47,,,47061000ZK0165,,,,,,,,,,,,,0,1,Maison,90,4,S,sols,,,500,0.169049,44.424693
2021-816813,2021-07-02,000001,Vente,188000,,,REJAUT,B063,47430,47061,Caumont-sur-Garonne,47,,,47061000ZK0166,,,,,,,,,,,,,0,,,,,AB,terrains a bâtir,,,1303,0.168945,44.424473
2021-816813,2021-07-02,000001,Vente,188000,,,REJAUT,B063,47430,47061,Caumont-sur-Garonne,47,,,47061000ZK0169,,,,,,,,,,,,,0,,,,,T,terres,,,23,0.16858,44.424582
2021-816813,2021-07-02,000001,Vente,188000,,,REJAUT,B063,47430,47061,Caumont-sur-Garonne,47,,,47061000ZK0170,,,,,,,,,,,,,0,,,,,T,terres,,,22,0.168726,44.424813
2021-816878,2021-07-17,000001,Vente,239300,9998,,LABORDE,B034,47430,47061,Caumont-sur-Garonne,47,,,47061000ZD0344,,,,,,,,,,,,,0,1,Maison,127,4,S,sols,,,500,0.179152,44.434801
2021-816878,2021-07-17,000001,Vente,239300,9998,,LABORDE,B034,47430,47061,Caumont-sur-Garonne,47,,,47061000ZD0344,,,,,,,,,,,,,0,3,Dépendance,,0,S,sols,,,500,0.179152,44.434801
2021-816878,2021-07-17,000001,Vente,239300,9998,,LABORDE,B034,47430,47061,Caumont-sur-Garonne,47,,,47061000ZD0344,,,,,,,,,,,,,0,3,Dépendance,,0,AG,terrains d'agrément,,,1738,0.179152,44.434801
2021-816878,2021-07-17,000001,Vente,239300,9998,,LABORDE,B034,47430,47061,Caumont-sur-Garonne,47,,,47061000ZD0344,,,,,,,,,,,,,0,1,Maison,127,4,AG,terrains d'agrément,,,1738,0.179152,44.434801
2021-817357,2021-07-26,000001,Vente,159000,7,,LE BOURG,B011,47430,47061,Caumont-sur-Garonne,47,,,47061000ZD0196,,,,,,,,,,,,,0,1,Maison,88,4,S,sols,,,1265,0.179055,44.436281
2021-817403,2021-08-05,000001,Vente,186500,201,,PORT DU QUAI,B061,47430,47061,Caumont-sur-Garonne,47,,,47061000ZI0068,,,,,,,,,,,,,0,3,Dépendance,,0,AG,terrains d'agrément,,,1272,0.187462,44.434479
2021-817403,2021-08-05,000001,Vente,186500,201,,PORT DU QUAI,B061,47430,47061,Caumont-sur-Garonne,47,,,47061000ZI0068,,,,,,,,,,,,,0,3,Dépendance,,0,S,sols,,,900,0.187462,44.434479
2021-817403,2021-08-05,000001,Vente,186500,201,,PORT DU QUAI,B061,47430,47061,Caumont-sur-Garonne,47,,,47061000ZI0068,,,,,,,,,,,,,0,1,Maison,109,4,S,sols,,,900,0.187462,44.434479
2021-817403,2021-08-05,000001,Vente,186500,201,,PORT DU QUAI,B061,47430,47061,Caumont-sur-Garonne,47,,,47061000ZI0068,,,,,,,,,,,,,0,1,Maison,109,4,AG,terrains d'agrément,,,1272,0.187462,44.434479
2021-817693,2021-08-25,000001,Vente,214250,233,,LE BOURG,B011,47430,47061,Caumont-sur-Garonne,47,,,470610000B0270,,,,,,,,,,,,,0,3,Dépendance,,0,PA,pâtures,PATUR,Pâture plantée,3000,0.179258,44.438993
2021-817693,2021-08-25,000001,Vente,214250,233,,LE BOURG,B011,47430,47061,Caumont-sur-Garonne,47,,,470610000B0270,,,,,,,,,,,,,0,1,Maison,118,6,PA,pâtures,PATUR,Pâture plantée,3000,0.179258,44.438993
2021-817693,2021-08-25,000001,Vente,214250,233,,LE BOURG,B011,47430,47061,Caumont-sur-Garonne,47,,,470610000B0270,,,,,,,,,,,,,0,3,Dépendance,,0,S,sols,,,815,0.179258,44.438993
2021-817693,2021-08-25,000001,Vente,214250,233,,LE BOURG,B011,47430,47061,Caumont-sur-Garonne,47,,,470610000B0270,,,,,,,,,,,,,0,1,Maison,118,6,S,sols,,,815,0.179258,44.438993
2021-818413,2021-09-04,000001,Vente,28000,,,VERDUTS,B077,47430,47061,Caumont-sur-Garonne,47,,,47061000ZC0034,,,,,,,,,,,,,0,,,,,T,terres,,,2570,0.168032,44.431953
2021-818413,2021-09-04,000001,Vente,28000,,,VERDUTS,B077,47430,47061,Caumont-sur-Garonne,47,,,47061000ZC0156,,,,,,,,,,,,,0,,,,,T,terres,,,40687,0.167676,44.430785
2021-818757,2021-09-28,000001,Vente,243000,9998,,LA CLERGUEZE,B016,47430,47061,Caumont-sur-Garonne,47,,,47061000ZI0123,,,,,,,,,,,,,0,1,Maison,125,4,AG,terrains d'agrément,,,1900,0.184705,44.434573
2021-818757,2021-09-28,000001,Vente,243000,9998,,LA CLERGUEZE,B016,47430,47061,Caumont-sur-Garonne,47,,,47061000ZI0123,,,,,,,,,,,,,0,1,Maison,125,4,S,sols,,,500,0.184705,44.434573
2021-818757,2021-09-28,000001,Vente,243000,,,LA CLERGUEZE,B016,47430,47061,Caumont-sur-Garonne,47,,,47061000ZI0125,,,,,,,,,,,,,0,,,,,T,terres,,,1425,0.184174,44.434566
2021-819438,2021-10-20,000001,Vente,139900,159,,LES RELIGIEUSES,B064,47430,47061,Caumont-sur-Garonne,47,,,47061000ZC0153,,,,,,,,,,,,,0,1,Maison,60,2,S,sols,,,3100,0.167881,44.424646
2021-819438,2021-10-20,000001,Vente,139900,159,,LES RELIGIEUSES,B064,47430,47061,Caumont-sur-Garonne,47,,,47061000ZC0153,,,,,,,,,,,,,0,1,Maison,125,4,S,sols,,,3100,0.167881,44.424646
2021-819438,2021-10-20,000001,Vente,139900,,,LES RELIGIEUSES,B064,47430,47061,Caumont-sur-Garonne,47,,,47061000ZC0158,,,,,,,,,,,,,0,,,,,T,terres,,,3792,0.166988,44.425012
2021-819588,2021-10-15,000001,Vente,105000,113,,VARENNES-OUEST,B076,47430,47061,Caumont-sur-Garonne,47,,,47061000ZH0105,,,,,,,,,,,,,0,1,Maison,200,5,S,sols,,,2458,0.198428,44.435992
2021-819588,2021-10-15,000001,Vente,105000,113,,VARENNES-OUEST,B076,47430,47061,Caumont-sur-Garonne,47,,,47061000ZH0105,,,,,,,,,,,,,0,3,Dépendance,,0,S,sols,,,2458,0.198428,44.435992
2021-819666,2021-10-22,000001,Vente,3500,,,MIMAUD,B047,47430,47061,Caumont-sur-Garonne,47,,,470610000D0129,,,,,,,,,,,,,0,,,,,T,terres,,,4160,0.162299,44.414176
2021-819666,2021-10-22,000001,Vente,3500,,,FORET DE CAUMONT,B023,47430,47061,Caumont-sur-Garonne,47,,,47061000ZM0021,,,,,,,,,,,,,0,,,,,T,terres,,,4830,0.164563,44.417695
2021-819687,2021-10-22,000001,Vente,55000,,,FORET DE CAUMONT,B023,47430,47061,Caumont-sur-Garonne,47,,,47061000ZM0033,,,,,,,,,,,,,0,,,,,T,terres,,,3920,0.16621,44.419849
2021-821964,2021-01-22,000001,Vente,103400,157,,LES RELIGIEUSES,B064,47430,47061,Caumont-sur-Garonne,47,,,47061000ZC0245,,,,,,,,,,,,,0,1,Maison,50,1,S,sols,,,900,0.168167,44.424777
2021-821964,2021-01-22,000001,Vente,103400,157,,LES RELIGIEUSES,B064,47430,47061,Caumont-sur-Garonne,47,,,47061000ZC0245,,,,,,,,,,,,,0,1,Maison,50,1,VI,vignes,,,900,0.168167,44.424777
2021-822181,2021-03-06,000001,Vente,30000,,,VERDUTS,B077,47430,47061,Caumont-sur-Garonne,47,,,47061000ZC0184,,,,,,,,,,,,,0,,,,,T,terres,,,7165,0.171648,44.430881
2021-822181,2021-03-06,000001,Vente,30000,,,VERDUTS,B077,47430,47061,Caumont-sur-Garonne,47,,,47061000ZC0187,,,,,,,,,,,,,0,,,,,T,terres,,,410,0.170738,44.430758
