id_mutation,date_mutation,numero_disposition,nature_mutation,valeur_fonciere,adresse_numero,adresse_suffixe,adresse_nom_voie,adresse_code_voie,code_postal,code_commune,nom_commune,code_departement,ancien_code_commune,ancien_nom_commune,id_parcelle,ancien_id_parcelle,numero_volume,lot1_numero,lot1_surface_carrez,lot2_numero,lot2_surface_carrez,lot3_numero,lot3_surface_carrez,lot4_numero,lot4_surface_carrez,lot5_numero,lot5_surface_carrez,nombre_lots,code_type_local,type_local,surface_reelle_bati,nombre_pieces_principales,code_nature_culture,nature_culture,code_nature_culture_speciale,nature_culture_speciale,surface_terrain,longitude,latitude
2021-812915,2021-01-07,000001,Vente,15000,70,,RTE DE GAUJAC,0011,47360,47104,Frégimont,47,,,47104000WC0073,,,,,,,,,,,,,0,,,,,T,terres,,,4848,0.465068,44.278852
2021-813481,2021-03-05,000001,Vente,15000,70,,RTE DE GAUJAC,0011,47360,47104,Frégimont,47,,,47104000WC0072,,,,,,,,,,,,,0,,,,,T,terres,,,2075,0.465968,44.279011
2021-818899,2021-10-04,000001,Vente,86000,10,,RTE DE SAINT SALVY,0016,47360,47104,Frégimont,47,,,471040000A1422,,,,,,,,,,,,,0,1,Maison,90,3,S,sols,,,355,0.457728,44.277237
2021-818899,2021-10-04,000001,Vente,86000,10,,RTE DE SAINT SALVY,0016,47360,47104,Frégimont,47,,,471040000A1422,,,,,,,,,,,,,0,3,Dépendance,,0,S,sols,,,355,0.457728,44.277237
2021-818899,2021-10-04,000001,Vente,86000,19,,LE BOURG,B014,47360,47104,Frégimont,47,,,471040000A1423,,,,,,,,,,,,,0,3,Dépendance,,0,S,sols,,,101,0.457734,44.277318
2021-819644,2021-10-30,000001,Vente,1000,,,METAIRIE DU BOIS,B056,47360,47104,Frégimont,47,,,47104000WK0003,,,,,,,,,,,,,0,,,,,BT,taillis simples,,,2520,0.474252,44.277982
2021-820131,2021-11-08,000001,Vente,60000,,,PEYROT DE L HOMME,B064,47360,47104,Frégimont,47,,,471040000C0678,,,,,,,,,,,,,0,,,,,L,landes,,,4206,0.485175,44.269455
2021-820131,2021-11-08,000001,Vente,60000,,,PEYROT DE L HOMME,B064,47360,47104,Frégimont,47,,,471040000C0679,,,,,,,,,,,,,0,,,,,BT,taillis simples,,,1404,0.484722,44.269221
2021-820131,2021-11-08,000001,Vente,60000,,,PEYROT DE L HOMME,B064,47360,47104,Frégimont,47,,,471040000C0684,,,,,,,,,,,,,0,,,,,BT,taillis simples,,,1010,0.484507,44.268853
2021-820131,2021-11-08,000001,Vente,60000,,,PEYROT DE L HOMME,B064,47360,47104,Frégimont,47,,,471040000C0869,,,,,,,,,,,,,0,,,,,L,landes,,,1690,0.484995,44.268729
2021-820131,2021-11-08,000001,Vente,60000,,,PEYROT DE L HOMME,B064,47360,47104,Frégimont,47,,,471040000C0870,,,,,,,,,,,,,0,,,,,L,landes,,,10,0.485183,44.268569
2021-820397,2021-11-25,000001,Vente,500,70,,RTE DE GAUJAC,0011,47360,47104,Frégimont,47,,,47104000WC0074,,,,,,,,,,,,,0,,,,,T,terres,,,3455,0.464713,44.278193
