id_mutation,date_mutation,numero_disposition,nature_mutation,valeur_fonciere,adresse_numero,adresse_suffixe,adresse_nom_voie,adresse_code_voie,code_postal,code_commune,nom_commune,code_departement,ancien_code_commune,ancien_nom_commune,id_parcelle,ancien_id_parcelle,numero_volume,lot1_numero,lot1_surface_carrez,lot2_numero,lot2_surface_carrez,lot3_numero,lot3_surface_carrez,lot4_numero,lot4_surface_carrez,lot5_numero,lot5_surface_carrez,nombre_lots,code_type_local,type_local,surface_reelle_bati,nombre_pieces_principales,code_nature_culture,nature_culture,code_nature_culture_speciale,nature_culture_speciale,surface_terrain,longitude,latitude
2021-813897,2021-03-31,000001,Vente,125000,,,DEGAY,B039,47800,47188,Montignac-de-Lauzun,47,,,471880000C0163,,,,,,,,,,,,,0,,,,,T,terres,,,3060,0.517203,44.566697
2021-813897,2021-03-31,000001,Vente,125000,,,DEGAY,B039,47800,47188,Montignac-de-Lauzun,47,,,471880000C0164,,,,,,,,,,,,,0,,,,,L,landes,,,665,0.517286,44.567177
2021-813897,2021-03-31,000001,Vente,125000,,,DEGAY,B039,47800,47188,Montignac-de-Lauzun,47,,,471880000C0165,,,,,,,,,,,,,0,3,Dépendance,,0,S,sols,,,2000,0.516481,44.567568
2021-813897,2021-03-31,000001,Vente,125000,,,DEGAY,B039,47800,47188,Montignac-de-Lauzun,47,,,471880000C0165,,,,,,,,,,,,,0,3,Dépendance,,0,S,sols,,,2000,0.516481,44.567568
2021-813897,2021-03-31,000001,Vente,125000,,,DEGAY,B039,47800,47188,Montignac-de-Lauzun,47,,,471880000C0165,,,,,,,,,,,,,0,1,Maison,300,9,S,sols,,,2000,0.516481,44.567568
2021-813897,2021-03-31,000001,Vente,125000,,,DEGAY,B039,47800,47188,Montignac-de-Lauzun,47,,,471880000C0165,,,,,,,,,,,,,0,3,Dépendance,,0,S,sols,,,2000,0.516481,44.567568
2021-813897,2021-03-31,000001,Vente,125000,,,DEGAY,B039,47800,47188,Montignac-de-Lauzun,47,,,471880000C0165,,,,,,,,,,,,,0,1,Maison,580,14,S,sols,,,2000,0.516481,44.567568
2021-813897,2021-03-31,000001,Vente,125000,,,DEGAY,B039,47800,47188,Montignac-de-Lauzun,47,,,471880000C0165,,,,,,,,,,,,,0,3,Dépendance,,0,AG,terrains d'agrément,,,5684,0.516481,44.567568
2021-813897,2021-03-31,000001,Vente,125000,,,DEGAY,B039,47800,47188,Montignac-de-Lauzun,47,,,471880000C0165,,,,,,,,,,,,,0,3,Dépendance,,0,AG,terrains d'agrément,,,5684,0.516481,44.567568
2021-813897,2021-03-31,000001,Vente,125000,,,DEGAY,B039,47800,47188,Montignac-de-Lauzun,47,,,471880000C0165,,,,,,,,,,,,,0,3,Dépendance,,0,AG,terrains d'agrément,,,5684,0.516481,44.567568
2021-813897,2021-03-31,000001,Vente,125000,,,DEGAY,B039,47800,47188,Montignac-de-Lauzun,47,,,471880000C0165,,,,,,,,,,,,,0,1,Maison,100,3,AG,terrains d'agrément,,,5684,0.516481,44.567568
2021-813897,2021-03-31,000001,Vente,125000,,,DEGAY,B039,47800,47188,Montignac-de-Lauzun,47,,,471880000C0165,,,,,,,,,,,,,0,1,Maison,300,9,AG,terrains d'agrément,,,5684,0.516481,44.567568
2021-813897,2021-03-31,000001,Vente,125000,,,DEGAY,B039,47800,47188,Montignac-de-Lauzun,47,,,471880000C0165,,,,,,,,,,,,,0,1,Maison,580,14,AG,terrains d'agrément,,,5684,0.516481,44.567568
2021-813897,2021-03-31,000001,Vente,125000,,,DEGAY,B039,47800,47188,Montignac-de-Lauzun,47,,,471880000C0165,,,,,,,,,,,,,0,1,Maison,100,3,S,sols,,,2000,0.516481,44.567568
2021-813897,2021-03-31,000001,Vente,125000,,,LA BORIO,B015,47800,47188,Montignac-de-Lauzun,47,,,471880000C0574,,,,,,,,,,,,,0,,,,,P,prés,,,798,0.518103,44.566015
2021-813897,2021-03-31,000001,Vente,125000,,,LA BORIO,B015,47800,47188,Montignac-de-Lauzun,47,,,471880000C0576,,,,,,,,,,,,,0,,,,,P,prés,,,212,0.518042,44.565808
2021-813897,2021-03-31,000001,Vente,125000,,,DEGAY,B039,47800,47188,Montignac-de-Lauzun,47,,,471880000C0578,,,,,,,,,,,,,0,,,,,P,prés,,,1550,0.516361,44.566295
2021-813897,2021-03-31,000001,Vente,125000,9998,,DEGAY,B039,47800,47188,Montignac-de-Lauzun,47,,,471880000C0580,,,,,,,,,,,,,0,1,Maison,100,2,PA,pâtures,PATUR,Pâture plantée,25176,0.516843,44.566872
2021-813897,2021-03-31,000001,Vente,125000,,,DEGAY,B039,47800,47188,Montignac-de-Lauzun,47,,,471880000C0582,,,,,,,,,,,,,0,,,,,T,terres,,,1055,0.517084,44.567745
2021-814621,2021-04-27,000001,Vente,2000,,,FORET DE MONTIGNAC,B044,47800,47188,Montignac-de-Lauzun,47,,,471880000A0049,,,,,,,,,,,,,0,,,,,BT,taillis simples,,,9810,0.465302,44.586823
2021-817497,2021-08-02,000001,Vente,182000,,,BARCELONNE,B006,47800,47188,Montignac-de-Lauzun,47,,,471880000A0152,,,,,,,,,,,,,0,,,,,T,terres,,,425,0.46878,44.581203
2021-817497,2021-08-02,000001,Vente,182000,,,BARCELONNE,B006,47800,47188,Montignac-de-Lauzun,47,,,471880000A0637,,,,,,,,,,,,,0,,,,,P,prés,,,1553,0.468571,44.581269
2021-817497,2021-08-02,000001,Vente,182000,,,BARCELONNE,B006,47800,47188,Montignac-de-Lauzun,47,,,471880000A0639,,,,,,,,,,,,,0,,,,,S,sols,,,561,0.46969,44.58146
2021-817497,2021-08-02,000001,Vente,182000,67,,BARCELONNE,B006,47800,47188,Montignac-de-Lauzun,47,,,471880000A0641,,,,,,,,,,,,,0,1,Maison,124,3,S,sols,,,2083,0.46946,44.581279
2021-817497,2021-08-02,000001,Vente,182000,,,BARCELONNE,B006,47800,47188,Montignac-de-Lauzun,47,,,471880000A0644,,,,,,,,,,,,,0,,,,,PA,pâtures,PATUR,Pâture plantée,2125,0.46883,44.581135
2021-817497,2021-08-02,000001,Vente,182000,,,BARCELONNE,B006,47800,47188,Montignac-de-Lauzun,47,,,471880000A0646,,,,,,,,,,,,,0,,,,,T,terres,,,214,0.469794,44.58124
2021-818134,2021-08-31,000001,Vente,7000,,,FORET DE MONTIGNAC,B044,47800,47188,Montignac-de-Lauzun,47,,,471880000A0052,,,,,,,,,,,,,0,,,,,BT,taillis simples,,,19155,0.462552,44.588469
2021-818940,2021-09-28,000001,Vente,2000,,,FORET DE MONTIGNAC,B044,47800,47188,Montignac-de-Lauzun,47,,,471880000A0056,,,,,,,,,,,,,0,,,,,BT,taillis simples,,,4445,0.464739,44.588293
2021-818940,2021-09-28,000001,Vente,2000,,,FORET DE MONTIGNAC,B044,47800,47188,Montignac-de-Lauzun,47,,,471880000A0056,,,,,,,,,,,,,0,,,,,BT,taillis simples,,,3690,0.464739,44.588293
2021-821985,2021-01-18,000001,Vente,3000,,,ROQUEBLANCHE,B105,47800,47188,Montignac-de-Lauzun,47,,,471880000D0109,,,,,,,,,,,,,0,,,,,T,terres,,,5320,0.47679,44.574996
2021-822178,2021-03-01,000001,Vente,460250,3,,LE BOURG-EST,B020,47800,47188,Montignac-de-Lauzun,47,,,471880000D0225,,,,,,,,,,,,,0,1,Maison,82,3,S,sols,,,1460,0.465997,44.573146
2021-822178,2021-03-01,000001,Vente,460250,3,,LE BOURG-EST,B020,47800,47188,Montignac-de-Lauzun,47,,,471880000D0225,,,,,,,,,,,,,0,3,Dépendance,,0,S,sols,,,1460,0.465997,44.573146
2021-822178,2021-03-01,000001,Vente,460250,3,,LE BOURG-EST,B020,47800,47188,Montignac-de-Lauzun,47,,,471880000D0225,,,,,,,,,,,,,0,3,Dépendance,,0,S,sols,,,1460,0.465997,44.573146
2021-822178,2021-03-01,000001,Vente,460250,3,,LE BOURG-EST,B020,47800,47188,Montignac-de-Lauzun,47,,,471880000D0225,,,,,,,,,,,,,0,1,Maison,288,4,S,sols,,,1460,0.465997,44.573146
2021-822178,2021-03-01,000001,Vente,460250,,,LE BOURG-EST,B020,47800,47188,Montignac-de-Lauzun,47,,,471880000D0250,,,,,,,,,,,,,0,,,,,P,prés,,,1562,0.46633,44.573482
2021-822178,2021-03-01,000001,Vente,460250,,,LE BOURG-EST,B020,47800,47188,Montignac-de-Lauzun,47,,,471880000D0250,,,,,,,,,,,,,0,,,,,T,terres,,,9738,0.46633,44.573482
2021-822178,2021-03-01,000001,Vente,460250,,,LE BOURG-EST,B020,47800,47188,Montignac-de-Lauzun,47,,,471880000D0251,,,,,,,,,,,,,0,,,,,P,prés,,,9440,0.467127,44.573908
2021-822178,2021-03-01,000001,Vente,460250,,,LE BOURG-EST,B020,47800,47188,Montignac-de-Lauzun,47,,,471880000D0734,,,,,,,,,,,,,0,,,,,T,terres,,,13190,0.465328,44.574303
