id_mutation,date_mutation,numero_disposition,nature_mutation,valeur_fonciere,adresse_numero,adresse_suffixe,adresse_nom_voie,adresse_code_voie,code_postal,code_commune,nom_commune,code_departement,ancien_code_commune,ancien_nom_commune,id_parcelle,ancien_id_parcelle,numero_volume,lot1_numero,lot1_surface_carrez,lot2_numero,lot2_surface_carrez,lot3_numero,lot3_surface_carrez,lot4_numero,lot4_surface_carrez,lot5_numero,lot5_surface_carrez,nombre_lots,code_type_local,type_local,surface_reelle_bati,nombre_pieces_principales,code_nature_culture,nature_culture,code_nature_culture_speciale,nature_culture_speciale,surface_terrain,longitude,latitude
2021-814113,2021-03-24,000001,Vente,50000,,,AU CHATARD,B020,47800,47194,Moustier,47,,,471940000A1203,,,,,,,,,,,,,0,,,,,T,terres,,,6766,0.296265,44.639108
2021-814113,2021-03-24,000001,Vente,50000,274,,IMP DE LA MARE,0098,47800,47194,Moustier,47,,,471940000A1204,,,,,,,,,,,,,0,1,Maison,75,3,S,sols,,,338,0.296233,44.639544
2021-814113,2021-03-24,000001,Vente,50000,274,,IMP DE LA MARE,0098,47800,47194,Moustier,47,,,471940000A1204,,,,,,,,,,,,,0,3,Dépendance,,0,S,sols,,,338,0.296233,44.639544
2021-814113,2021-03-24,000001,Vente,50000,,,AU CHATARD,B020,47800,47194,Moustier,47,,,471940000A1208,,,,,,,,,,,,,0,,,,,T,terres,,,1971,0.296644,44.639194
2021-814118,2021-03-24,000001,Vente,10000,,,AU CHATARD,B020,47800,47194,Moustier,47,,,471940000A0636,,,,,,,,,,,,,0,,,,,T,terres,,,1050,0.296722,44.639705
2021-814118,2021-03-24,000001,Vente,10000,,,AU CHATARD,B020,47800,47194,Moustier,47,,,471940000A1206,,,,,,,,,,,,,0,,,,,S,sols,,,374,0.296698,44.639528
2021-814118,2021-03-24,000001,Vente,10000,,,AU SARAILLIER,B068,47800,47194,Moustier,47,,,471940000A1215,,,,,,,,,,,,,0,,,,,S,sols,,,17,0.296873,44.63949
2021-814356,2021-04-16,000001,Vente,170000,548,,RTE MARGUERITE DURAS,0092,47800,47194,Moustier,47,,,471940000A1634,,,,,,,,,,,,,0,1,Maison,80,3,S,sols,,,1387,0.286534,44.635921
2021-814356,2021-04-16,000001,Vente,170000,,,AUX NAUZES,B046,47800,47194,Moustier,47,,,471940000A1638,,,,,,,,,,,,,0,,,,,S,sols,,,349,0.286415,44.635702
2021-815209,2021-05-17,000001,Vente,2000,,,PARRAU,B049,47800,47194,Moustier,47,,,471940000A0389,,,,,,,,,,,,,0,,,,,BT,taillis simples,,,1460,0.293885,44.644354
2021-815209,2021-05-17,000001,Vente,2000,,,PARRAU,B049,47800,47194,Moustier,47,,,471940000A0390,,,,,,,,,,,,,0,,,,,BT,taillis simples,,,2370,0.293687,44.644541
2021-815577,2021-05-24,000001,Vente,170000,,,PARRAU,B049,47800,47194,Moustier,47,,,471940000A0389,,,,,,,,,,,,,0,,,,,BT,taillis simples,,,1460,0.293885,44.644354
2021-815577,2021-05-24,000001,Vente,170000,,,PARRAU,B049,47800,47194,Moustier,47,,,471940000A0390,,,,,,,,,,,,,0,,,,,BT,taillis simples,,,2370,0.293687,44.644541
2021-815577,2021-05-24,000001,Vente,170000,,,PARRAU,B049,47800,47194,Moustier,47,,,471940000A1656,,,,,,,,,,,,,0,,,,,T,terres,,,1392,0.295116,44.644729
2021-815577,2021-05-24,000001,Vente,170000,1211,,RTE DES BRUGEAUX,0096,47800,47194,Moustier,47,,,471940000A1661,,,,,,,,,,,,,0,1,Maison,102,4,T,terres,,,1917,0.294589,44.644394
2021-815577,2021-05-24,000001,Vente,170000,1211,,RTE DES BRUGEAUX,0096,47800,47194,Moustier,47,,,471940000A1661,,,,,,,,,,,,,0,1,Maison,102,4,S,sols,,,1000,0.294589,44.644394
2021-815707,2021-06-07,000001,Vente,596,,,SISSAC,B071,47800,47194,Moustier,47,,,471940000B1406,,,,,,,,,,,,,0,,,,,S,sols,,,261,0.303565,44.651169
2021-815707,2021-06-07,000001,Vente,596,,,SISSAC,B071,47800,47194,Moustier,47,,,471940000B1408,,,,,,,,,,,,,0,,,,,S,sols,,,429,0.303783,44.65117
2021-815707,2021-06-07,000001,Vente,596,,,SISSAC,B071,47800,47194,Moustier,47,,,471940000B1410,,,,,,,,,,,,,0,,,,,T,terres,,,480,0.30573,44.650428
2021-815761,2021-05-31,000001,Vente,179000,,,A LA CROIX,B026,47800,47194,Moustier,47,,,471940000A0834,,,,,,,,,,,,,0,,,,,T,terres,,,4620,0.295669,44.635615
2021-815761,2021-05-31,000001,Vente,179000,92,,RTE DES BRUGEAUX,0096,47800,47194,Moustier,47,,,471940000A0835,,,,,,,,,,,,,0,1,Maison,87,4,S,sols,,,1520,0.293545,44.635554
2021-815761,2021-05-31,000001,Vente,179000,,,A LA CROIX,B026,47800,47194,Moustier,47,,,471940000A1879,,,,,,,,,,,,,0,,,,,T,terres,,,18313,0.294005,44.63525
2021-816475,2021-06-09,000002,Vente,233,,,COULOUMA,B025,47800,47194,Moustier,47,,,471940000B1420,,,,,,,,,,,,,0,,,,,T,terres,,,233,0.305398,44.653098
2021-817414,2021-08-05,000001,Vente,512500,3409,,RTE DES COTEAUX,0095,47800,47194,Moustier,47,,,471940000A0515,,,,,,,,,,,,,0,3,Dépendance,,0,S,sols,,,2071,0.286341,44.649628
2021-817414,2021-08-05,000001,Vente,512500,3409,,RTE DES COTEAUX,0095,47800,47194,Moustier,47,,,471940000A0515,,,,,,,,,,,,,0,1,Maison,320,8,S,sols,,,2071,0.286341,44.649628
2021-817414,2021-08-05,000001,Vente,512500,,,PRE DU RIEU,B058,47800,47194,Moustier,47,,,471940000A0571,,,,,,,,,,,,,0,,,,,P,prés,,,4580,0.281564,44.647889
2021-817414,2021-08-05,000001,Vente,512500,,,PRE DU RIEU,B058,47800,47194,Moustier,47,,,471940000A0571,,,,,,,,,,,,,0,,,,,L,landes,,,3520,0.281564,44.647889
2021-817414,2021-08-05,000001,Vente,512500,,,PRE DU RIEU,B058,47800,47194,Moustier,47,,,471940000A0572,,,,,,,,,,,,,0,,,,,T,terres,,,1630,0.282302,44.64826
2021-817414,2021-08-05,000001,Vente,512500,,,PRE DU RIEU,B058,47800,47194,Moustier,47,,,471940000A0573,,,,,,,,,,,,,0,,,,,BT,taillis simples,,,1310,0.281259,44.648455
2021-817414,2021-08-05,000001,Vente,512500,,,PRE DU RIEU,B058,47800,47194,Moustier,47,,,471940000A0574,,,,,,,,,,,,,0,,,,,BT,taillis simples,,,2935,0.281397,44.648855
2021-817414,2021-08-05,000001,Vente,512500,,,PRE DU RIEU,B058,47800,47194,Moustier,47,,,471940000A0577,,,,,,,,,,,,,0,,,,,T,terres,,,8470,0.282197,44.649006
2021-817414,2021-08-05,000001,Vente,512500,,,PRE DU RIEU,B058,47800,47194,Moustier,47,,,471940000A0578,,,,,,,,,,,,,0,,,,,T,terres,,,2350,0.282952,44.648359
2021-817414,2021-08-05,000001,Vente,512500,,,PRE DU RIEU,B058,47800,47194,Moustier,47,,,471940000A0579,,,,,,,,,,,,,0,,,,,T,terres,,,9670,0.283503,44.649233
2021-817414,2021-08-05,000001,Vente,512500,,,MOULIN A VENT,B044,47800,47194,Moustier,47,,,471940000A1276,,,,,,,,,,,,,0,,,,,P,prés,,,92,0.285965,44.649908
2021-817414,2021-08-05,000001,Vente,512500,,,MOULIN A VENT,B044,47800,47194,Moustier,47,,,471940000A1279,,,,,,,,,,,,,0,,,,,P,prés,,,3449,0.286129,44.649584
2021-817414,2021-08-05,000001,Vente,512500,,,MOULIN A VENT,B044,47800,47194,Moustier,47,,,471940000A1281,,,,,,,,,,,,,0,,,,,T,terres,,,4596,0.285715,44.649206
2021-817414,2021-08-05,000001,Vente,512500,,,MOULIN A VENT,B044,47800,47194,Moustier,47,,,471940000A1282,,,,,,,,,,,,,0,,,,,T,terres,,,15991,0.284713,44.649101
2021-817469,2021-07-28,000001,Vente,150000,,,LA VENELLE,B076,47800,47194,Moustier,47,,,471940000A0756,,,,,,,,,,,,,0,,,,,T,terres,,,5440,0.294086,44.629491
2021-817469,2021-07-28,000001,Vente,150000,,,LA VENELLE,B076,47800,47194,Moustier,47,,,471940000A0758,,,,,,,,,,,,,0,,,,,T,terres,,,5825,0.293485,44.629675
2021-817837,2021-08-21,000001,Vente,10500,,,REPICAYRE,B062,47800,47194,Moustier,47,,,471940000A0057,,,,,,,,,,,,,0,,,,,BT,taillis simples,,,1730,0.294959,44.65354
2021-817837,2021-08-21,000001,Vente,10500,,,REPICAYRE,B062,47800,47194,Moustier,47,,,471940000A0061,,,,,,,,,,,,,0,,,,,BT,taillis simples,,,4160,0.29471,44.654206
2021-817837,2021-08-21,000001,Vente,10500,,,REPICAYRE,B062,47800,47194,Moustier,47,,,471940000A0062,,,,,,,,,,,,,0,,,,,BT,taillis simples,,,3140,0.295144,44.654674
2021-819349,2021-10-11,000001,Vente,313900,341,,RTE DU MOULIN A VENT,0094,47800,47194,Moustier,47,,,471940000A1704,,,,,,,,,,,,,0,1,Maison,123,4,T,terres,,,5897,0.284437,44.639225
2021-819349,2021-10-11,000001,Vente,313900,341,,RTE DU MOULIN A VENT,0094,47800,47194,Moustier,47,,,471940000A1704,,,,,,,,,,,,,0,1,Maison,123,4,S,sols,,,1500,0.284437,44.639225
2021-819349,2021-10-11,000001,Vente,313900,341,,RTE DU MOULIN A VENT,0094,47800,47194,Moustier,47,,,471940000A1704,,,,,,,,,,,,,0,3,Dépendance,,0,T,terres,,,5897,0.284437,44.639225
2021-819349,2021-10-11,000001,Vente,313900,341,,RTE DU MOULIN A VENT,0094,47800,47194,Moustier,47,,,471940000A1704,,,,,,,,,,,,,0,3,Dépendance,,0,T,terres,,,5897,0.284437,44.639225
2021-819349,2021-10-11,000001,Vente,313900,341,,RTE DU MOULIN A VENT,0094,47800,47194,Moustier,47,,,471940000A1704,,,,,,,,,,,,,0,3,Dépendance,,0,S,sols,,,1500,0.284437,44.639225
2021-819349,2021-10-11,000001,Vente,313900,341,,RTE DU MOULIN A VENT,0094,47800,47194,Moustier,47,,,471940000A1704,,,,,,,,,,,,,0,3,Dépendance,,0,S,sols,,,1500,0.284437,44.639225
2021-819349,2021-10-11,000001,Vente,313900,,,A MARSOU,B039,47800,47194,Moustier,47,,,471940000A1750,,,,,,,,,,,,,0,,,,,T,terres,,,1829,0.283831,44.638754
2021-820697,2021-12-10,000001,Vente,89000,1343,,RTE GALLO ROMAINE,0085,47800,47194,Moustier,47,,,471940000B0723,,,,,,,,,,,,,0,1,Maison,100,3,S,sols,,,473,0.309326,44.635995
2021-820697,2021-12-10,000001,Vente,89000,1343,,RTE GALLO ROMAINE,0085,47800,47194,Moustier,47,,,471940000B0723,,,,,,,,,,,,,0,3,Dépendance,,0,S,sols,,,473,0.309326,44.635995
2021-820697,2021-12-10,000001,Vente,89000,,,LA MANE,B035,47800,47194,Moustier,47,,,471940000B0724,,,,,,,,,,,,,0,,,,,J,jardins,MARAI,Pré marais,387,0.309125,44.635957
2021-820697,2021-12-10,000001,Vente,89000,,,LA MANE,B035,47800,47194,Moustier,47,,,471940000B0850,,,,,,,,,,,,,0,,,,,T,terres,,,245,0.309221,44.636057
2021-820697,2021-12-10,000001,Vente,89000,,,LA MANE,B035,47800,47194,Moustier,47,,,471940000B1313,,,,,,,,,,,,,0,,,,,J,jardins,POTAG,Jardin potager,241,0.308904,44.635993
2021-820697,2021-12-10,000001,Vente,89000,,,LA MANE,B035,47800,47194,Moustier,47,,,471940000B1314,,,,,,,,,,,,,0,,,,,T,terres,,,183,0.308747,44.635931
2021-820840,2021-11-24,000001,Vente,226943,,,A LA CROIX,B026,47800,47194,Moustier,47,,,471940000A1266,,,,,,,,,,,,,0,,,,,L,landes,,,177,0.295351,44.633078
2021-820840,2021-11-24,000001,Vente,226943,191,,IMP DE LA GARE,0084,47800,47194,Moustier,47,,,471940000A1295,,,,,,,,,,,,,0,1,Maison,99,4,S,sols,,,1856,0.294647,44.633019
2021-820840,2021-11-24,000001,Vente,226943,191,,IMP DE LA GARE,0084,47800,47194,Moustier,47,,,471940000A1295,,,,,,,,,,,,,0,3,Dépendance,,0,T,terres,,,2160,0.294647,44.633019
2021-820840,2021-11-24,000001,Vente,226943,191,,IMP DE LA GARE,0084,47800,47194,Moustier,47,,,471940000A1295,,,,,,,,,,,,,0,3,Dépendance,,0,S,sols,,,1856,0.294647,44.633019
2021-820840,2021-11-24,000001,Vente,226943,191,,IMP DE LA GARE,0084,47800,47194,Moustier,47,,,471940000A1295,,,,,,,,,,,,,0,1,Maison,99,4,T,terres,,,2160,0.294647,44.633019
2021-820840,2021-11-24,000001,Vente,226943,191,,IMP DE LA GARE,0084,47800,47194,Moustier,47,,,471940000A1295,,,,,,,,,,,,,0,3,Dépendance,,0,T,terres,,,1045,0.294647,44.633019
2021-820840,2021-11-24,000001,Vente,226943,191,,IMP DE LA GARE,0084,47800,47194,Moustier,47,,,471940000A1295,,,,,,,,,,,,,0,1,Maison,99,4,T,terres,,,1045,0.294647,44.633019
2021-821946,2021-01-20,000001,Vente,165370,,,BELLERIVE,B005,47800,47194,Moustier,47,,,471940000B1413,,,,,,,,,,,,,0,1,Maison,93,6,AG,terrains d'agrément,,,1187,0.313746,44.635802
2021-821946,2021-01-20,000001,Vente,165370,,,BELLERIVE,B005,47800,47194,Moustier,47,,,471940000B1413,,,,,,,,,,,,,0,1,Maison,93,6,S,sols,,,1000,0.313746,44.635802
2021-821946,2021-01-20,000001,Vente,165370,,,BELLERIVE,B005,47800,47194,Moustier,47,,,471940000B1415,,,,,,,,,,,,,0,,,,,S,sols,,,27,0.313635,44.636344
2021-822189,2021-03-02,000001,Vente,120000,,,A LA CROIX,B026,47800,47194,Moustier,47,,,471940000A0841,,,,,,,,,,,,,0,,,,,T,terres,,,2155,0.291422,44.6352
2021-822189,2021-03-02,000001,Vente,120000,,,A LA CROIX,B026,47800,47194,Moustier,47,,,471940000A0849,,,,,,,,,,,,,0,,,,,BT,taillis simples,,,845,0.291045,44.636206
2021-822189,2021-03-02,000001,Vente,120000,,,A LA CROIX,B026,47800,47194,Moustier,47,,,471940000A0850,,,,,,,,,,,,,0,,,,,P,prés,,,3390,0.291427,44.636243
2021-822189,2021-03-02,000001,Vente,120000,,,A LA CROIX,B026,47800,47194,Moustier,47,,,471940000A0850,,,,,,,,,,,,,0,,,,,S,sols,,,380,0.291427,44.636243
2021-822189,2021-03-02,000001,Vente,120000,126,,RTE MARGUERITE DURAS,0092,47800,47194,Moustier,47,,,471940000A0851,,,,,,,,,,,,,0,1,Maison,95,3,S,sols,,,990,0.291221,44.636514
2021-822189,2021-03-02,000001,Vente,120000,,,A LA CROIX,B026,47800,47194,Moustier,47,,,471940000A1772,,,,,,,,,,,,,0,,,,,T,terres,,,8420,0.290975,44.636332
