id_mutation,date_mutation,numero_disposition,nature_mutation,valeur_fonciere,adresse_numero,adresse_suffixe,adresse_nom_voie,adresse_code_voie,code_postal,code_commune,nom_commune,code_departement,ancien_code_commune,ancien_nom_commune,id_parcelle,ancien_id_parcelle,numero_volume,lot1_numero,lot1_surface_carrez,lot2_numero,lot2_surface_carrez,lot3_numero,lot3_surface_carrez,lot4_numero,lot4_surface_carrez,lot5_numero,lot5_surface_carrez,nombre_lots,code_type_local,type_local,surface_reelle_bati,nombre_pieces_principales,code_nature_culture,nature_culture,code_nature_culture_speciale,nature_culture_speciale,surface_terrain,longitude,latitude
2021-815168,2021-05-12,000001,Vente,124000,190,,RTE DE CASTILLONNES,0018,47330,47272,Saint-Quentin-du-Dropt,47,,,47272000AN0006,,,,,,,,,,,,,0,1,Maison,105,5,S,sols,,,1607,0.601523,44.682386
2021-815230,2021-05-06,000001,Echange,6000,,,AUX CAUMONTS,B028,47330,47272,Saint-Quentin-du-Dropt,47,,,47272000AI0032,,,,,,,,,,,,,0,,,,,T,terres,,,1771,0.617634,44.685004
2021-815230,2021-05-06,000001,Echange,6000,,,AUX CAUMONTS,B028,47330,47272,Saint-Quentin-du-Dropt,47,,,47272000AI0033,,,,,,,,,,,,,0,,,,,T,terres,,,975,0.617817,44.685187
2021-815230,2021-05-06,000001,Echange,6000,,,AUX CAUMONTS,B028,47330,47272,Saint-Quentin-du-Dropt,47,,,47272000AI0035,,,,,,,,,,,,,0,,,,,T,terres,,,2978,0.618385,44.68501
2021-815230,2021-05-06,000001,Echange,6000,,,AUX CAUMONTS,B028,47330,47272,Saint-Quentin-du-Dropt,47,,,47272000AI0231,,,,,,,,,,,,,0,,,,,T,terres,,,3507,0.618612,44.684751
2021-815231,2021-05-06,000002,Echange,15000,,,AUX CAUMONTS,B028,47330,47272,Saint-Quentin-du-Dropt,47,,,47272000AI0021,,,,,,,,,,,,,0,,,,,T,terres,,,2053,0.617656,44.683515
2021-815231,2021-05-06,000002,Echange,15000,,,AUX CAUMONTS,B028,47330,47272,Saint-Quentin-du-Dropt,47,,,47272000AI0022,,,,,,,,,,,,,0,,,,,P,prés,,,21080,0.619192,44.682956
2021-815602,2021-06-09,000001,Vente,4500,,,LAVERGNE,B057,47330,47272,Saint-Quentin-du-Dropt,47,,,47272000AP0095,,,,,,,,,,,,,0,,,,,L,landes,,,2759,0.575642,44.670533
2021-815602,2021-06-09,000001,Vente,4500,,,CHAMPS DU DROPT,B031,47330,47272,Saint-Quentin-du-Dropt,47,,,47272000AP0152,,,,,,,,,,,,,0,,,,,T,terres,,,2661,0.577048,44.672778
2021-816097,2021-06-07,000002,Vente,6516,,,LE BOURG NORD,B015,47330,47272,Saint-Quentin-du-Dropt,47,,,47272000AD0292,,,,,,,,,,,,,0,,,,,P,prés,,,7240,0.598819,44.685266
2021-817399,2021-07-22,000001,Vente,301887,,,PRAIRIE DU PONT DE CAUSE,B080,47330,47272,Saint-Quentin-du-Dropt,47,,,47272000AO0005,,,,,,,,,,,,,0,,,,,PA,pâtures,PATUR,Pâture plantée,2800,0.582715,44.672364
2021-817399,2021-07-22,000001,Vente,301887,271,,PRAIRIE DU PONT DE CAUSE,B080,47330,47272,Saint-Quentin-du-Dropt,47,,,47272000AO0006,,,,,,,,,,,,,0,1,Maison,140,4,S,sols,,,197,0.583816,44.6721
2021-817399,2021-07-22,000001,Vente,301887,,,PRAIRIE DU PONT DE CAUSE,B080,47330,47272,Saint-Quentin-du-Dropt,47,,,47272000AO0007,,,,,,,,,,,,,0,,,,,PA,pâtures,PATUR,Pâture plantée,1995,0.583882,44.672247
2021-819151,2021-10-08,000001,Vente,285465,590,,RTE D'EYRENVILLE,0022,47330,47272,Saint-Quentin-du-Dropt,47,,,47272000AD0076,,,,,,,,,,,,,0,1,Maison,160,4,S,sols,,,2420,0.594041,44.685429
2021-819151,2021-10-08,000001,Vente,285465,,,PIECES DU MOULIN,B074,47330,47272,Saint-Quentin-du-Dropt,47,,,47272000AD0077,,,,,,,,,,,,,0,,,,,PA,pâtures,PATUR,Pâture plantée,1590,0.593471,44.685427
2021-819151,2021-10-08,000001,Vente,285465,,,PIECES DU MOULIN,B074,47330,47272,Saint-Quentin-du-Dropt,47,,,47272000AD0216,,,,,,,,,,,,,0,,,,,T,terres,,,581,0.594044,44.685143
2021-819151,2021-10-08,000001,Vente,285465,,,PIECES DU MOULIN,B074,47330,47272,Saint-Quentin-du-Dropt,47,,,47272000AD0219,,,,,,,,,,,,,0,,,,,T,terres,,,1522,0.594711,44.685288
2021-819286,2021-10-14,000001,Vente,65000,3,,LE BOURG SUD,B017,47330,47272,Saint-Quentin-du-Dropt,47,,,47272000AN0011,,,,,,,,,,,,,0,1,Maison,130,4,S,sols,,,297,0.600479,44.683914
2021-819286,2021-10-14,000001,Vente,65000,,,LE BOURG SUD,B017,47330,47272,Saint-Quentin-du-Dropt,47,,,47272000AN0012,,,,,,,,,,,,,0,,,,,AG,terrains d'agrément,JARD,Jardin d'agrément,309,0.600606,44.683563
2021-820764,2021-11-16,000001,Vente,150000,185,,RTE BASSE,0014,47330,47272,Saint-Quentin-du-Dropt,47,,,47272000AN0088,,,,,,,,,,,,,0,3,Dépendance,,0,S,sols,,,454,0.593989,44.676864
2021-820764,2021-11-16,000001,Vente,150000,185,,RTE BASSE,0014,47330,47272,Saint-Quentin-du-Dropt,47,,,47272000AN0088,,,,,,,,,,,,,0,3,Dépendance,,0,S,sols,,,454,0.593989,44.676864
2021-820764,2021-11-16,000001,Vente,150000,185,,RTE BASSE,0014,47330,47272,Saint-Quentin-du-Dropt,47,,,47272000AN0088,,,,,,,,,,,,,0,1,Maison,125,5,S,sols,,,454,0.593989,44.676864
2021-820764,2021-11-16,000001,Vente,150000,,,CATUS-HAUT-EST,B026,47330,47272,Saint-Quentin-du-Dropt,47,,,47272000AN0089,,,,,,,,,,,,,0,,,,,S,sols,,,435,0.594118,44.676948
2021-820764,2021-11-16,000001,Vente,150000,,,CATUS-HAUT-EST,B026,47330,47272,Saint-Quentin-du-Dropt,47,,,47272000AN0090,,,,,,,,,,,,,0,,,,,T,terres,,,746,0.593936,44.677063
2021-820764,2021-11-16,000001,Vente,150000,,,CATUS-HAUT-EST,B026,47330,47272,Saint-Quentin-du-Dropt,47,,,47272000AN0090,,,,,,,,,,,,,0,,,,,S,sols,,,401,0.593936,44.677063
2021-820764,2021-11-16,000001,Vente,150000,,,CATUS-HAUT-EST,B026,47330,47272,Saint-Quentin-du-Dropt,47,,,47272000AN0137,,,,,,,,,,,,,0,,,,,J,jardins,,,941,0.594331,44.677057
2021-820764,2021-11-16,000001,Vente,150000,,,CATUS-HAUT-EST,B026,47330,47272,Saint-Quentin-du-Dropt,47,,,47272000AN0139,,,,,,,,,,,,,0,,,,,J,jardins,,,316,0.59416,44.676735
2021-821898,2021-08-05,000001,Vente,6000,,,AU PASTENS,B071,47330,47272,Saint-Quentin-du-Dropt,47,,,47272000AD0001,,,,,,,,,,,,,0,,,,,P,prés,,,11470,0.597991,44.695095
2021-821898,2021-08-05,000001,Vente,6000,,,AU PASTENS,B071,47330,47272,Saint-Quentin-du-Dropt,47,,,47272000AD0002,,,,,,,,,,,,,0,,,,,T,terres,,,5823,0.598548,44.694283
2021-821898,2021-08-05,000001,Vente,6000,,,PECHAULY,B072,47330,47272,Saint-Quentin-du-Dropt,47,,,47272000AD0181,,,,,,,,,,,,,0,,,,,PA,pâtures,PATUR,Pâture plantée,283,0.597087,44.695259
2021-821898,2021-08-05,000001,Vente,6000,,,DEFRICHE,B036,47330,47272,Saint-Quentin-du-Dropt,47,,,47272000AD0255,,,,,,,,,,,,,0,,,,,P,prés,,,4301,0.597185,44.692753
2021-822566,2021-02-25,000001,Vente,312500,,,LE TURCAT,B085,47330,47272,Saint-Quentin-du-Dropt,47,,,47272000AH0057,,,,,,,,,,,,,0,,,,,T,terres,,,5795,0.613433,44.684916
2021-822566,2021-02-25,000001,Vente,312500,,,AU SABLOU,B083,47330,47272,Saint-Quentin-du-Dropt,47,,,47272000AH0071,,,,,,,,,,,,,0,,,,,E,eaux,LAC,Lac,3440,0.613112,44.684313
2021-822566,2021-02-25,000001,Vente,312500,,,AU SABLOU,B083,47330,47272,Saint-Quentin-du-Dropt,47,,,47272000AH0071,,,,,,,,,,,,,0,,,,,T,terres,,,2300,0.613112,44.684313
2021-822566,2021-02-25,000001,Vente,312500,,,AU SABLOU,B083,47330,47272,Saint-Quentin-du-Dropt,47,,,47272000AH0072,,,,,,,,,,,,,0,,,,,T,terres,,,2660,0.612632,44.683671
2021-822566,2021-02-25,000001,Vente,312500,,,AU SABLOU,B083,47330,47272,Saint-Quentin-du-Dropt,47,,,47272000AH0073,,,,,,,,,,,,,0,,,,,S,sols,,,354,0.612345,44.682716
2021-822566,2021-02-25,000001,Vente,312500,,,AU SABLOU,B083,47330,47272,Saint-Quentin-du-Dropt,47,,,47272000AH0074,,,,,,,,,,,,,0,,,,,T,terres,,,9560,0.612386,44.682986
2021-822566,2021-02-25,000001,Vente,312500,,,AU SABLOU,B083,47330,47272,Saint-Quentin-du-Dropt,47,,,47272000AH0075,,,,,,,,,,,,,0,,,,,T,terres,,,5066,0.611724,44.683297
2021-822566,2021-02-25,000001,Vente,312500,,,AU SABLOU,B083,47330,47272,Saint-Quentin-du-Dropt,47,,,47272000AH0076,,,,,,,,,,,,,0,,,,,T,terres,,,3397,0.611204,44.683369
2021-822566,2021-02-25,000001,Vente,312500,,,AU SABLOU,B083,47330,47272,Saint-Quentin-du-Dropt,47,,,47272000AH0077,,,,,,,,,,,,,0,,,,,T,terres,,,1430,0.611388,44.683646
2021-822566,2021-02-25,000001,Vente,312500,,,AU SABLOU,B083,47330,47272,Saint-Quentin-du-Dropt,47,,,47272000AH0079,,,,,,,,,,,,,0,,,,,T,terres,,,20931,0.61086,44.682105
2021-822566,2021-02-25,000001,Vente,312500,,,AU SABLOU,B083,47330,47272,Saint-Quentin-du-Dropt,47,,,47272000AH0124,,,,,,,,,,,,,0,,,,,E,eaux,LAC,Lac,800,0.612958,44.683378
2021-822566,2021-02-25,000001,Vente,312500,,,AU SABLOU,B083,47330,47272,Saint-Quentin-du-Dropt,47,,,47272000AH0124,,,,,,,,,,,,,0,,,,,T,terres,,,2280,0.612958,44.683378
2021-822566,2021-02-25,000001,Vente,312500,,,LE TURCAT,B085,47330,47272,Saint-Quentin-du-Dropt,47,,,47272000AH0132,,,,,,,,,,,,,0,,,,,T,terres,,,638,0.613668,44.684881
2021-822566,2021-02-25,000001,Vente,312500,,,AUX CAUMONTS,B028,47330,47272,Saint-Quentin-du-Dropt,47,,,47272000AI0018,,,,,,,,,,,,,0,,,,,T,terres,,,9225,0.615606,44.683495
2021-822566,2021-02-25,000001,Vente,312500,,,AUX CAUMONTS,B028,47330,47272,Saint-Quentin-du-Dropt,47,,,47272000AI0018,,,,,,,,,,,,,0,,,,,E,eaux,LAC,Lac,600,0.615606,44.683495
2021-822566,2021-02-25,000001,Vente,312500,,,AUX CAUMONTS,B028,47330,47272,Saint-Quentin-du-Dropt,47,,,47272000AI0019,,,,,,,,,,,,,0,,,,,E,eaux,LAC,Lac,760,0.615976,44.684183
2021-822566,2021-02-25,000001,Vente,312500,,,AUX CAUMONTS,B028,47330,47272,Saint-Quentin-du-Dropt,47,,,47272000AI0019,,,,,,,,,,,,,0,,,,,T,terres,,,13520,0.615976,44.684183
2021-822566,2021-02-25,000001,Vente,312500,,,AUX CAUMONTS,B028,47330,47272,Saint-Quentin-du-Dropt,47,,,47272000AI0020,,,,,,,,,,,,,0,,,,,T,terres,,,3870,0.61686,44.683601
2021-822566,2021-02-25,000001,Vente,312500,,,AUX CAUMONTS,B028,47330,47272,Saint-Quentin-du-Dropt,47,,,47272000AI0032,,,,,,,,,,,,,0,,,,,T,terres,,,1771,0.617634,44.685004
2021-822566,2021-02-25,000001,Vente,312500,,,AUX CAUMONTS,B028,47330,47272,Saint-Quentin-du-Dropt,47,,,47272000AI0033,,,,,,,,,,,,,0,,,,,T,terres,,,975,0.617817,44.685187
2021-822566,2021-02-25,000001,Vente,312500,,,AUX CAUMONTS,B028,47330,47272,Saint-Quentin-du-Dropt,47,,,47272000AI0035,,,,,,,,,,,,,0,,,,,T,terres,,,2978,0.618385,44.68501
2021-822566,2021-02-25,000001,Vente,312500,,,AU PLASSAL,B076,47330,47272,Saint-Quentin-du-Dropt,47,,,47272000AI0170,,,,,,,,,,,,,0,,,,,T,terres,,,3700,0.6159,44.680675
2021-822566,2021-02-25,000001,Vente,312500,,,AU PLASSAL,B076,47330,47272,Saint-Quentin-du-Dropt,47,,,47272000AI0171,,,,,,,,,,,,,0,,,,,T,terres,,,23750,0.615783,44.681464
2021-822566,2021-02-25,000001,Vente,312500,,,AU PLASSAL,B076,47330,47272,Saint-Quentin-du-Dropt,47,,,47272000AI0172,,,,,,,,,,,,,0,,,,,BT,taillis simples,,,1456,0.61466,44.681995
2021-822566,2021-02-25,000001,Vente,312500,,,AU PLASSAL,B076,47330,47272,Saint-Quentin-du-Dropt,47,,,47272000AI0197,,,,,,,,,,,,,0,,,,,T,terres,,,3056,0.614638,44.683369
2021-822566,2021-02-25,000001,Vente,312500,,,AU PLASSAL,B076,47330,47272,Saint-Quentin-du-Dropt,47,,,47272000AI0199,,,,,,,,,,,,,0,,,,,T,terres,,,1397,0.613855,44.682146
2021-822566,2021-02-25,000001,Vente,312500,,,AU PLASSAL,B076,47330,47272,Saint-Quentin-du-Dropt,47,,,47272000AI0200,,,,,,,,,,,,,0,,,,,T,terres,,,4225,0.613563,44.6825
2021-822566,2021-02-25,000001,Vente,312500,,,AU PLASSAL,B076,47330,47272,Saint-Quentin-du-Dropt,47,,,47272000AI0201,,,,,,,,,,,,,0,,,,,T,terres,,,7090,0.61375,44.683627
2021-822566,2021-02-25,000001,Vente,312500,,,AU PLASSAL,B076,47330,47272,Saint-Quentin-du-Dropt,47,,,47272000AI0201,,,,,,,,,,,,,0,,,,,E,eaux,LAC,Lac,4520,0.61375,44.683627
2021-822566,2021-02-25,000001,Vente,312500,,,AUX CAUMONTS,B028,47330,47272,Saint-Quentin-du-Dropt,47,,,47272000AI0231,,,,,,,,,,,,,0,,,,,T,terres,,,3507,0.618612,44.684751
2021-822566,2021-02-25,000001,Vente,312500,,,AUX CAUMONTS,B028,47330,47272,Saint-Quentin-du-Dropt,47,,,47272000AI0257,,,,,,,,,,,,,0,,,,,S,sols,,,132,0.614377,44.685296
2021-822566,2021-02-25,000001,Vente,312500,,,AUX CAUMONTS,B028,47330,47272,Saint-Quentin-du-Dropt,47,,,47272000AI0260,,,,,,,,,,,,,0,,,,,T,terres,,,9040,0.614036,44.684683
2021-822566,2021-02-25,000001,Vente,312500,,,AUX CAUMONTS,B028,47330,47272,Saint-Quentin-du-Dropt,47,,,47272000AI0260,,,,,,,,,,,,,0,,,,,E,eaux,LAC,Lac,5160,0.614036,44.684683
2021-822566,2021-02-25,000001,Vente,312500,980,,CHE DES BOIS,0001,47330,47272,Saint-Quentin-du-Dropt,47,,,47272000AI0271,,,,,,,,,,,,,0,1,Maison,117,6,S,sols,,,550,0.611851,44.681535
2021-822566,2021-02-25,000001,Vente,312500,980,,CHE DES BOIS,0001,47330,47272,Saint-Quentin-du-Dropt,47,,,47272000AI0271,,,,,,,,,,,,,0,1,Maison,117,6,T,terres,,,10897,0.611851,44.681535
2021-822566,2021-02-25,000001,Vente,312500,,,AU PLASSAL,B076,47330,47272,Saint-Quentin-du-Dropt,47,,,47272000AI0272,,,,,,,,,,,,,0,,,,,T,terres,,,16364,0.612847,44.681879
2021-822566,2021-02-25,000001,Vente,312500,,,AU PLASSAL,B076,47330,47272,Saint-Quentin-du-Dropt,47,,,47272000AI0272,,,,,,,,,,,,,0,,,,,S,sols,,,4040,0.612847,44.681879
