id_mutation,date_mutation,numero_disposition,nature_mutation,valeur_fonciere,adresse_numero,adresse_suffixe,adresse_nom_voie,adresse_code_voie,code_postal,code_commune,nom_commune,code_departement,ancien_code_commune,ancien_nom_commune,id_parcelle,ancien_id_parcelle,numero_volume,lot1_numero,lot1_surface_carrez,lot2_numero,lot2_surface_carrez,lot3_numero,lot3_surface_carrez,lot4_numero,lot4_surface_carrez,lot5_numero,lot5_surface_carrez,nombre_lots,code_type_local,type_local,surface_reelle_bati,nombre_pieces_principales,code_nature_culture,nature_culture,code_nature_culture_speciale,nature_culture_speciale,surface_terrain,longitude,latitude
2021-822777,2021-01-13,000001,Vente,35000,5101,,PRADINES,C219,48150,48096,Meyrueis,48,,,480960000G0064,,,,,,,,,,,,,0,1,Maison,39,3,S,sols,,,76,3.434419,44.169438
2021-823094,2021-03-07,000001,Vente,3847.95,,,LAS CAZES,B760,48150,48096,Meyrueis,48,,,480960000G0241,,,,,,,,,,,,,0,,,,,L,landes,,,20380,3.446645,44.155756
2021-823094,2021-03-07,000001,Vente,3847.95,,,LAS CAZES,B760,48150,48096,Meyrueis,48,,,480960000G0242,,,,,,,,,,,,,0,,,,,PA,pâtures,PATUR,Pâture plantée,564,3.447776,44.155861
2021-823094,2021-03-07,000001,Vente,3847.95,,,LAS CAZES,B760,48150,48096,Meyrueis,48,,,480960000G0243,,,,,,,,,,,,,0,,,,,P,prés,,,3480,3.446923,44.155383
2021-823094,2021-03-07,000001,Vente,3847.95,,,LAS CAZES,B760,48150,48096,Meyrueis,48,,,480960000G0244,,,,,,,,,,,,,0,,,,,L,landes,,,13045,3.446677,44.155014
2021-823094,2021-03-07,000001,Vente,3847.95,,,LAS CAZES,B760,48150,48096,Meyrueis,48,,,480960000G0245,,,,,,,,,,,,,0,,,,,BT,taillis simples,,,4332,3.448547,44.155124
2021-823094,2021-03-07,000001,Vente,3847.95,,,HUBAQUETS DE VALBEYRON,B723,48150,48096,Meyrueis,48,,,480960000G0428,,,,,,,,,,,,,0,,,,,T,terres,,,3255,3.445641,44.154906
2021-823094,2021-03-07,000001,Vente,3847.95,,,HUBAQUETS DE VALBEYRON,B723,48150,48096,Meyrueis,48,,,480960000G0429,,,,,,,,,,,,,0,,,,,PA,pâtures,PATUR,Pâture plantée,710,3.446495,44.155432
2021-823094,2021-03-07,000001,Vente,3847.95,,,COMBLES,B433,48150,48096,Meyrueis,48,,,480960000G0764,,,,,,,,,,,,,0,,,,,BT,taillis simples,,,31193,3.433899,44.145806
2021-823173,2021-03-17,000001,Vente,7500,1,,RUE DU PLANET,0080,48150,48096,Meyrueis,48,,,480960000I0388,,,,,,,,,,,,,0,1,Maison,72,6,S,sols,,,75,3.428659,44.179352
2021-823215,2021-03-20,000001,Vente,85000,5465,,RON ROUGE,C369,48150,48096,Meyrueis,48,,,480960000C0490,,,1,,11,,5,161.89,6,,7,,5,3,Dépendance,,0,,,,,,3.433879,44.182353
2021-823215,2021-03-20,000001,Vente,85000,5465,,RON ROUGE,C369,48150,48096,Meyrueis,48,,,480960000C0490,,,1,,11,,5,161.89,6,,7,,5,2,Appartement,125,6,,,,,,3.433879,44.182353
2021-823215,2021-03-20,000001,Vente,85000,5465,,RON ROUGE,C369,48150,48096,Meyrueis,48,,,480960000C0490,,,1,,11,,5,161.89,6,,7,,5,3,Dépendance,,0,,,,,,3.433879,44.182353
2021-823520,2021-04-23,000001,Vente,66000,4,,RUE DE LA VILLE,0113,48150,48096,Meyrueis,48,,,480960000I0385,,,,,,,,,,,,,0,2,Appartement,25,2,S,sols,,,49,3.428515,44.179482
2021-823520,2021-04-23,000001,Vente,66000,4,,RUE DE LA VILLE,0113,48150,48096,Meyrueis,48,,,480960000I0385,,,,,,,,,,,,,0,4,Local industriel. commercial ou assimilé,30,0,S,sols,,,49,3.428515,44.179482
2021-823520,2021-04-23,000001,Vente,66000,4,,RUE DE LA VILLE,0113,48150,48096,Meyrueis,48,,,480960000I0385,,,,,,,,,,,,,0,2,Appartement,28,2,S,sols,,,49,3.428515,44.179482
2021-823520,2021-04-23,000001,Vente,66000,,,MEYRUEIS VILLAGE,C017,48150,48096,Meyrueis,48,,,480960000I0535,,,,,,,,,,,,,0,,,,,J,jardins,,,25,3.429132,44.180761
2021-823520,2021-04-23,000001,Vente,66000,,,MEYRUEIS VILLAGE,C017,48150,48096,Meyrueis,48,,,480960000I0537,,,,,,,,,,,,,0,,,,,J,jardins,,,88,3.428937,44.180675
2021-823598,2021-05-06,000001,Vente,64.64,,,DEVEZ PAUPARELLES,B580,48150,48096,Meyrueis,48,,,480960000C0694,,,,,,,,,,,,,0,,,,,L,landes,,,404,3.431888,44.182627
2021-823758,2021-05-10,000001,Vente,123000,5010,,SALVINSAC,C416,48150,48096,Meyrueis,48,,,480960000C0142,,,,,,,,,,,,,0,1,Maison,77,3,S,sols,,,1485,3.459843,44.197552
2021-823758,2021-05-10,000001,Vente,123000,5010,,SALVINSAC,C416,48150,48096,Meyrueis,48,,,480960000C0142,,,,,,,,,,,,,0,3,Dépendance,,0,S,sols,,,1485,3.459843,44.197552
2021-823758,2021-05-10,000001,Vente,123000,,,LES CANIS,B269,48150,48096,Meyrueis,48,,,480960000C0486,,,,,,,,,,,,,0,,,,,S,sols,,,290,3.460018,44.197682
2021-823788,2021-05-25,000001,Vente,25980,5,,AV EA MARTEL,0065,48150,48096,Meyrueis,48,,,480960000I0914,,2,,,,,,,,,,,0,,,,,,,,,,3.430335,44.179889
2021-823788,2021-05-25,000001,Vente,25980,5,,AV EA MARTEL,0065,48150,48096,Meyrueis,48,,,480960000I0914,,3,,,,,,,,,,,0,,,,,,,,,,3.430335,44.179889
2021-823788,2021-05-25,000001,Vente,25980,5,,AV EA MARTEL,0065,48150,48096,Meyrueis,48,,,480960000I0914,,4,,,,,,,,,,,0,,,,,,,,,,3.430335,44.179889
2021-823788,2021-05-25,000001,Vente,25980,5,,AV EA MARTEL,0065,48150,48096,Meyrueis,48,,,480960000I0916,,,,,,,,,,,,,0,,,,,S,sols,,,24,3.430469,44.179872
2021-823804,2021-06-04,000001,Vente,75090,4,,RUE SAINT PIERRE,0101,48150,48096,Meyrueis,48,,,480960000I0071,,,,,,,,,,,,,0,1,Maison,80,5,S,sols,,,48,3.429504,44.178518
2021-823804,2021-06-04,000001,Vente,75090,,,MEYRUEIS VILLAGE,C017,48150,48096,Meyrueis,48,,,480960000I0120,,,,,,,,,,,,,0,,,,,J,jardins,,,118,3.430215,44.177845
2021-823811,2021-06-11,000001,Vente,225000,,,SERIGAS,C432,48150,48096,Meyrueis,48,,,480960000H0328,,,,,,,,,,,,,0,,,,,S,sols,,,146,3.40544,44.181199
2021-823811,2021-06-11,000001,Vente,225000,6146,,SERIGAS,C432,48150,48096,Meyrueis,48,,,480960000H0329,,,,,,,,,,,,,0,3,Dépendance,,0,S,sols,,,234,3.405472,44.181309
2021-823811,2021-06-11,000001,Vente,225000,6146,,SERIGAS,C432,48150,48096,Meyrueis,48,,,480960000H0329,,,,,,,,,,,,,0,2,Appartement,52,3,S,sols,,,234,3.405472,44.181309
2021-823811,2021-06-11,000001,Vente,225000,6146,,SERIGAS,C432,48150,48096,Meyrueis,48,,,480960000H0329,,,,,,,,,,,,,0,2,Appartement,81,2,S,sols,,,234,3.405472,44.181309
2021-823811,2021-06-11,000001,Vente,225000,6146,,SERIGAS,C432,48150,48096,Meyrueis,48,,,480960000H0329,,,,,,,,,,,,,0,3,Dépendance,,0,S,sols,,,234,3.405472,44.181309
2021-823811,2021-06-11,000001,Vente,225000,,,SERIGAS,C432,48150,48096,Meyrueis,48,,,480960000H0783,,,,,,,,,,,,,0,,,,,P,prés,,,398,3.405571,44.181426
2021-823811,2021-06-11,000001,Vente,225000,,,SERIGAS,C432,48150,48096,Meyrueis,48,,,480960000H0784,,,,,,,,,,,,,0,,,,,P,prés,,,46,3.405747,44.181457
2021-823811,2021-06-11,000001,Vente,225000,,,SERIGAS,C432,48150,48096,Meyrueis,48,,,480960000H0785,,,,,,,,,,,,,0,,,,,P,prés,,,16,3.40543,44.18139
2021-823811,2021-06-11,000001,Vente,225000,,,SERIGAS,C432,48150,48096,Meyrueis,48,,,480960000H0786,,,,,,,,,,,,,0,,,,,S,sols,,,5,3.405372,44.181313
2021-824021,2021-07-05,000001,Vente,85800,,,LES BREAUX,B174,48150,48096,Meyrueis,48,,,480960000A0030,,,,,,,,,,,,,0,,,,,L,landes,,,79740,3.387342,44.228245
2021-824021,2021-07-05,000001,Vente,85800,,,CHEMIN DE DRIGAS,B359,48150,48096,Meyrueis,48,,,480960000A0165,,,,,,,,,,,,,0,,,,,L,landes,,,94785,3.374596,44.228257
2021-824021,2021-07-05,000001,Vente,85800,,,LOU PIC HAUREN,B871,48150,48096,Meyrueis,48,,,480960000B0002,,,,,,,,,,,,,0,,,,,L,landes,,,87883,3.365833,44.220437
2021-824021,2021-07-05,000001,Vente,85800,,,LOU PIC HAUREN,B871,48150,48096,Meyrueis,48,,,480960000B0002,,,,,,,,,,,,,0,,,,,L,landes,,,87883,3.365833,44.220437
2021-824021,2021-07-05,000001,Vente,85800,,,LOU RAJAL,B882,48150,48096,Meyrueis,48,,,480960000B0027,,,,,,,,,,,,,0,,,,,J,jardins,,,472,3.366936,44.216278
2021-824021,2021-07-05,000001,Vente,85800,,,L ADRECH,B004,48150,48096,Meyrueis,48,,,480960000B0031,,,,,,,,,,,,,0,,,,,L,landes,,,95540,3.369107,44.218932
2021-824021,2021-07-05,000001,Vente,85800,,,LE CLEDOUX,B381,48150,48096,Meyrueis,48,,,480960000B0094,,,,,,,,,,,,,0,,,,,T,terres,,,31360,3.367342,44.213991
2021-824021,2021-07-05,000001,Vente,85800,,,LE CLEDOUX,B381,48150,48096,Meyrueis,48,,,480960000B0094,,,,,,,,,,,,,0,,,,,S,sols,,,1000,3.367342,44.213991
2021-824021,2021-07-05,000001,Vente,85800,,,LE CLEDOUX,B381,48150,48096,Meyrueis,48,,,480960000B0095,,,,,,,,,,,,,0,,,,,L,landes,,,3553,3.366784,44.214657
2021-824021,2021-07-05,000001,Vente,85800,,,LOU RAJAL,B882,48150,48096,Meyrueis,48,,,480960000B0212,,,,,,,,,,,,,0,,,,,J,jardins,,,210,3.366579,44.216058
2021-824021,2021-07-05,000001,Vente,85800,,,LOU RAJAL,B882,48150,48096,Meyrueis,48,,,480960000B0215,,,,,,,,,,,,,0,,,,,L,landes,,,674,3.366719,44.216142
2021-824086,2021-07-08,000001,Vente,80000,9,,RUE DU PONT VIEUX,0087,48150,48096,Meyrueis,48,,,480960000I0441,,,,,,,,,,,,,0,2,Appartement,25,1,S,sols,,,210,3.428011,44.180103
2021-824086,2021-07-08,000001,Vente,80000,9,,RUE DU PONT VIEUX,0087,48150,48096,Meyrueis,48,,,480960000I0441,,,,,,,,,,,,,0,3,Dépendance,,0,S,sols,,,210,3.428011,44.180103
2021-824086,2021-07-08,000001,Vente,80000,9,,RUE DU PONT VIEUX,0087,48150,48096,Meyrueis,48,,,480960000I0441,,,,,,,,,,,,,0,2,Appartement,70,4,S,sols,,,210,3.428011,44.180103
2021-824086,2021-07-08,000001,Vente,80000,,,MEYRUEIS VILLAGE,C017,48150,48096,Meyrueis,48,,,480960000I0442,,,,,,,,,,,,,0,,,,,J,jardins,,,100,3.427857,44.180155
2021-824180,2021-08-03,000001,Vente,300,,,LA CONDAMINE,B457,48150,48096,Meyrueis,48,,,480960000C0554,,,,,,,,,,,,,0,,,,,L,landes,,,102,3.434459,44.181759
2021-824180,2021-08-03,000001,Vente,300,,,LA CONDAMINE,B457,48150,48096,Meyrueis,48,,,480960000C0557,,,,,,,,,,,,,0,,,,,T,terres,,,1038,3.434322,44.18187
2021-824312,2021-07-29,000001,Vente,191000,2,,RUE MONSEIGNEUR MARET,0064,48150,48096,Meyrueis,48,,,480960000I0203,,,,,,,,,,,,,0,4,Local industriel. commercial ou assimilé,240,0,S,sols,,,220,3.428637,44.177661
2021-824312,2021-07-29,000001,Vente,191000,2,,RUE MONSEIGNEUR MARET,0064,48150,48096,Meyrueis,48,,,480960000I0203,,,,,,,,,,,,,0,4,Local industriel. commercial ou assimilé,85,0,S,sols,,,220,3.428637,44.177661
2021-824312,2021-07-29,000001,Vente,191000,2,,RUE MONSEIGNEUR MARET,0064,48150,48096,Meyrueis,48,,,480960000I0203,,,,,,,,,,,,,0,1,Maison,56,2,S,sols,,,220,3.428637,44.177661
2021-824312,2021-07-29,000001,Vente,191000,,,MEYRUEIS VILLAGE,C017,48150,48096,Meyrueis,48,,,480960000I0204,,,,,,,,,,,,,0,,,,,AG,terrains d'agrément,PARC,Parc,270,3.428604,44.177553
2021-824312,2021-07-29,000001,Vente,191000,4,,RUE MONSEIGNEUR MARET,0064,48150,48096,Meyrueis,48,,,480960000I0921,,,,,,,,,,,,,0,,,,,S,sols,,,49,3.428751,44.177639
2021-824392,2021-08-31,000001,Vente,24000,7,,RUE DU BARRY,0010,48150,48096,Meyrueis,48,,,480960000I0155,,,,,,,,,,,,,0,3,Dépendance,,0,S,sols,,,125,3.429722,44.176992
2021-824394,2021-09-03,000001,Vente,227500,13,,AV EA MARTEL,0065,48150,48096,Meyrueis,48,,,480960000I0820,,,,,,,,,,,,,0,4,Local industriel. commercial ou assimilé,15,0,S,sols,,,848,3.430683,44.181033
2021-824394,2021-09-03,000001,Vente,227500,13,,AV EA MARTEL,0065,48150,48096,Meyrueis,48,,,480960000I0820,,,,,,,,,,,,,0,1,Maison,180,5,S,sols,,,848,3.430683,44.181033
2021-824452,2021-09-16,000001,Vente,37000,,,SABREUSAC,C406,48150,48096,Meyrueis,48,,,480960000C0189,,,,,,,,,,,,,0,,,,,T,terres,,,152,3.457268,44.196425
2021-824452,2021-09-16,000001,Vente,37000,6244,,SALVINSAC,C416,48150,48096,Meyrueis,48,,,480960000C0192,,,,,,,,,,,,,0,1,Maison,52,3,S,sols,,,205,3.457471,44.19618
2021-824565,2021-09-24,000001,Vente,99000,20,,QUAI DU PONT VIEUX,0086,48150,48096,Meyrueis,48,,,480960000I0507,,,,,,,,,,,,,0,1,Maison,115,4,S,sols,,,174,3.427468,44.180771
2021-824735,2021-09-24,000001,Vente,36000,2,,RUE SAINT BLAISE,0094,48150,48096,Meyrueis,48,,,480960000I0066,,,,,,,,,,,,,0,2,Appartement,65,0,S,sols,,,109,3.429516,44.178736
2021-824735,2021-09-24,000001,Vente,36000,2,,RUE SAINT BLAISE,0094,48150,48096,Meyrueis,48,,,480960000I0066,,,,,,,,,,,,,0,2,Appartement,75,4,S,sols,,,109,3.429516,44.178736
2021-824735,2021-09-24,000001,Vente,36000,2,,RUE SAINT BLAISE,0094,48150,48096,Meyrueis,48,,,480960000I0066,,,,,,,,,,,,,0,3,Dépendance,,0,S,sols,,,109,3.429516,44.178736
2021-824735,2021-09-24,000001,Vente,36000,2,,RUE SAINT BLAISE,0094,48150,48096,Meyrueis,48,,,480960000I0066,,,,,,,,,,,,,0,3,Dépendance,,0,S,sols,,,109,3.429516,44.178736
2021-824788,2021-10-25,000001,Vente,155650,5232,,PL SAINT PIERRE,0100,48150,48096,Meyrueis,48,,,480960000I0189,,,,,,,,,,,,,0,1,Maison,85,6,S,sols,,,132,3.42965,44.178289
2021-824936,2021-10-28,000001,Vente,30000,5115,A,MARJOAB,B992,48150,48096,Meyrueis,48,,,480960000H0740,,,,,,,,,,,,,0,4,Local industriel. commercial ou assimilé,,,S,sols,,,400,3.426827,44.1623
2021-824951,2021-11-09,000001,Vente,65000,5373,,PL DU PLANET,0079,48150,48096,Meyrueis,48,,,480960000I0425,,,,,,,,,,,,,0,1,Maison,50,4,S,sols,,,20,3.428503,44.179242
2021-824951,2021-11-09,000001,Vente,65000,7,,RUE DU CHATEAU,0028,48150,48096,Meyrueis,48,,,480960000I0426,,,,,,,,,,,,,0,1,Maison,20,1,S,sols,,,128,3.428424,44.179309
2021-824951,2021-11-09,000001,Vente,65000,7,,RUE DU CHATEAU,0028,48150,48096,Meyrueis,48,,,480960000I0426,,,,,,,,,,,,,0,1,Maison,50,3,S,sols,,,128,3.428424,44.179309
2021-824961,2021-11-16,000001,Vente,265735.97,,,MIALLETTE,C019,48150,48096,Meyrueis,48,,,480960000A0007,,,,,,,,,,,,,0,,,,,T,terres,,,15866,3.3719,44.224953
2021-824961,2021-11-16,000001,Vente,265735.97,,,MIALLETTE,C019,48150,48096,Meyrueis,48,,,480960000A0008,,,,,,,,,,,,,0,,,,,L,landes,,,96646,3.370426,44.224144
2021-825003,2021-11-08,000001,Vente,219000,6050,,LES AYRES,B048,48150,48096,Meyrueis,48,,,480960000D1347,,,,,,,,,,,,,0,1,Maison,83,4,S,sols,,,700,3.440276,44.18122
2021-825003,2021-11-08,000001,Vente,219000,6050,,LES AYRES,B048,48150,48096,Meyrueis,48,,,480960000D1347,,,,,,,,,,,,,0,1,Maison,83,4,L,landes,,,2265,3.440276,44.18122
2021-825003,2021-11-08,000001,Vente,219000,6050,,LES AYRES,B048,48150,48096,Meyrueis,48,,,480960000D1347,,,,,,,,,,,,,0,3,Dépendance,,0,S,sols,,,700,3.440276,44.18122
2021-825003,2021-11-08,000001,Vente,219000,6050,,LES AYRES,B048,48150,48096,Meyrueis,48,,,480960000D1347,,,,,,,,,,,,,0,3,Dépendance,,0,L,landes,,,2265,3.440276,44.18122
2021-825077,2021-12-07,000001,Vente,69.6,,,CAPELAN,B279,48150,48096,Meyrueis,48,,,480960000H0829,,,,,,,,,,,,,0,,,,,L,landes,,,464,3.419718,44.189242
2021-825167,2021-12-07,000001,Vente,88000,4,,RUE DE L HORLOGE,0057,48150,48096,Meyrueis,48,,,480960000I0365,,,,,,,,,,,,,0,2,Appartement,60,3,S,sols,,,135,3.428968,44.179644
2021-825167,2021-12-07,000001,Vente,88000,4,,RUE DE L HORLOGE,0057,48150,48096,Meyrueis,48,,,480960000I0365,,,,,,,,,,,,,0,2,Appartement,48,2,S,sols,,,135,3.428968,44.179644
2021-825167,2021-12-07,000001,Vente,88000,4,,RUE DE L HORLOGE,0057,48150,48096,Meyrueis,48,,,480960000I0365,,,,,,,,,,,,,0,2,Appartement,60,3,S,sols,,,135,3.428968,44.179644
2021-825167,2021-12-07,000001,Vente,88000,4,,RUE DE L HORLOGE,0057,48150,48096,Meyrueis,48,,,480960000I0365,,,,,,,,,,,,,0,4,Local industriel. commercial ou assimilé,30,0,S,sols,,,135,3.428968,44.179644
2021-825167,2021-12-07,000001,Vente,88000,4,,RUE DE L HORLOGE,0057,48150,48096,Meyrueis,48,,,480960000I0365,,,,,,,,,,,,,0,4,Local industriel. commercial ou assimilé,6,0,S,sols,,,135,3.428968,44.179644
