id_mutation,date_mutation,numero_disposition,nature_mutation,valeur_fonciere,adresse_numero,adresse_suffixe,adresse_nom_voie,adresse_code_voie,code_postal,code_commune,nom_commune,code_departement,ancien_code_commune,ancien_nom_commune,id_parcelle,ancien_id_parcelle,numero_volume,lot1_numero,lot1_surface_carrez,lot2_numero,lot2_surface_carrez,lot3_numero,lot3_surface_carrez,lot4_numero,lot4_surface_carrez,lot5_numero,lot5_surface_carrez,nombre_lots,code_type_local,type_local,surface_reelle_bati,nombre_pieces_principales,code_nature_culture,nature_culture,code_nature_culture_speciale,nature_culture_speciale,surface_terrain,longitude,latitude
2021-841250,2021-01-22,000001,Vente,100000,17,,AV DES ROCHES,0670,49590,49140,Fontevraud-l'Abbaye,49,,,491400000D0662,,,,,,,,,,,,,0,1,Maison,160,5,S,sols,,,265,0.049366,47.187245
2021-841277,2021-01-19,000002,Vente,1,,,LA SOCRAIE,B095,49590,49140,Fontevraud-l'Abbaye,49,,,491400000D1410,,,,,,,,,,,,,0,,,,,S,sols,,,70,0.045992,47.191001
2021-841423,2021-02-01,000001,Vente,5000,,,RUE DES POTIERS,0620,49590,49140,Fontevraud-l'Abbaye,49,,,491400000F0369,,,,,,,,,,,,,0,,,,,T,terres,,,452,0.053176,47.174118
2021-841423,2021-02-01,000001,Vente,5000,,,RUE DES POTIERS,0620,49590,49140,Fontevraud-l'Abbaye,49,,,491400000F0372,,,,,,,,,,,,,0,,,,,T,terres,,,469,0.053247,47.173906
2021-841423,2021-02-01,000001,Vente,5000,,,RUE DES POTIERS,0620,49590,49140,Fontevraud-l'Abbaye,49,,,491400000F0955,,,,,,,,,,,,,0,,,,,S,sols,,,174,0.053103,47.173977
2021-841486,2021-02-15,000001,Vente,113000,8,,RUE ROBERT D ARBRISSEL,0650,49590,49140,Fontevraud-l'Abbaye,49,,,491400000D1168,,,4,,7,,,,,,,,2,3,Dépendance,,0,,,,,,0.04909,47.181922
2021-841486,2021-02-15,000001,Vente,113000,5,,RUE DES MASQUES,0540,49590,49140,Fontevraud-l'Abbaye,49,,,491400000D1287,,,,,,,,,,,,,0,1,Maison,150,5,S,sols,,,139,0.049199,47.181952
2021-841486,2021-02-15,000001,Vente,113000,5577,F,RUE DES MASQUES,0540,49590,49140,Fontevraud-l'Abbaye,49,,,491400000D1288,,,,,,,,,,,,,0,3,Dépendance,,0,S,sols,,,64,0.049074,47.182188
2021-841499,2021-03-01,000001,Vente,85000,17,,RUE DE L HERMITAGE,0440,49590,49140,Fontevraud-l'Abbaye,49,,,491400000F0914,,,,,,,,,,,,,0,1,Maison,60,2,S,sols,,,418,0.052887,47.178903
2021-841590,2021-02-26,000001,Vente,36010,,,RUE DES POTIERS,0620,49590,49140,Fontevraud-l'Abbaye,49,,,491400000F0332,,,,,,,,,,,,,0,,,,,T,terres,,,666,0.053253,47.175497
2021-841590,2021-02-26,000001,Vente,36010,5372,,RUE DES POTIERS,0620,49590,49140,Fontevraud-l'Abbaye,49,,,491400000F0333,,,,,,,,,,,,,0,3,Dépendance,,0,S,sols,,,940,0.053047,47.175498
2021-841762,2021-03-29,000001,Vente,63000,,,LES ROCHES,B092,49590,49140,Fontevraud-l'Abbaye,49,,,491400000E0169,,,,,,,,,,,,,0,,,,,L,landes,,,420,0.050628,47.19239
2021-841762,2021-03-29,000001,Vente,63000,,,LES ROCHES,B092,49590,49140,Fontevraud-l'Abbaye,49,,,491400000E0171,,,,,,,,,,,,,0,,,,,L,landes,,,525,0.050277,47.192515
2021-841762,2021-03-29,000001,Vente,63000,,,LES ROCHES,B092,49590,49140,Fontevraud-l'Abbaye,49,,,491400000E0172,,,,,,,,,,,,,0,,,,,L,landes,,,105,0.050413,47.192519
2021-841762,2021-03-29,000001,Vente,63000,,,LES ROCHES,B092,49590,49140,Fontevraud-l'Abbaye,49,,,491400000E0173,,,,,,,,,,,,,0,,,,,L,landes,,,169,0.050283,47.192575
2021-841762,2021-03-29,000001,Vente,63000,,,LES ROCHES,B092,49590,49140,Fontevraud-l'Abbaye,49,,,491400000E0599,,,,,,,,,,,,,0,,,,,S,sols,,,20,0.050283,47.192279
2021-841762,2021-03-29,000001,Vente,63000,,,LES ROCHES,B092,49590,49140,Fontevraud-l'Abbaye,49,,,491400000E0601,,,,,,,,,,,,,0,,,,,L,landes,,,70,0.05009,47.19249
2021-841762,2021-03-29,000001,Vente,63000,,,LES ROCHES,B092,49590,49140,Fontevraud-l'Abbaye,49,,,491400000E0602,,,,,,,,,,,,,0,,,,,L,landes,,,98,0.050274,47.192381
2021-841762,2021-03-29,000001,Vente,63000,144,,AV DES ROCHES,0670,49590,49140,Fontevraud-l'Abbaye,49,,,491400000E0603,,,,,,,,,,,,,0,1,Maison,30,1,S,sols,,,473,0.050113,47.192402
2021-841762,2021-03-29,000001,Vente,63000,,,LES ROCHES,B092,49590,49140,Fontevraud-l'Abbaye,49,,,491400000E0642,,,,,,,,,,,,,0,,,,,J,jardins,POTAG,Jardin potager,142,0.050091,47.192678
2021-842101,2021-05-06,000001,Vente,87000,16,,RUE DE LA CITE LA LIZANDIERE,0294,49590,49140,Fontevraud-l'Abbaye,49,,,49140000ZC0205,,,,,,,,,,,,,0,1,Maison,76,4,S,sols,,,567,0.043184,47.179405
2021-842232,2021-05-25,000001,Vente,200,,,CANTON DE LA DESGRIERE,B024,49590,49140,Fontevraud-l'Abbaye,49,,,491400000B0861,,,,,,,,,,,,,0,,,,,BT,taillis simples,CHAT,Châtaigneraie,610,0.038564,47.196298
2021-842232,2021-05-25,000001,Vente,200,,,CANTON DE LA DESGRIERE,B024,49590,49140,Fontevraud-l'Abbaye,49,,,491400000B0865,,,,,,,,,,,,,0,,,,,BT,taillis simples,CHAT,Châtaigneraie,450,0.038656,47.196683
2021-842238,2021-05-21,000001,Vente,2310,,,IMP DE BEAULIEU,0215,49590,49140,Fontevraud-l'Abbaye,49,,,491400000D0499,,,,,,,,,,,,,0,,,,,J,jardins,POTAG,Jardin potager,550,0.044692,47.182463
2021-842243,2021-02-19,000002,Vente,4050,,,LE BOURG,B013,49590,49140,Fontevraud-l'Abbaye,49,,,491400000D1408,,,,,,,,,,,,,0,,,,,J,jardins,POTAG,Jardin potager,962,0.046157,47.182778
2021-842446,2021-06-11,000001,Vente,50000,5,,PL DES BLATIERS,0230,49590,49140,Fontevraud-l'Abbaye,49,,,491400000F0111,,,,,,,,,,,,,0,1,Maison,70,3,S,sols,,,336,0.050942,47.182463
2021-842488,2021-06-08,000001,Vente,17000,50,B,RUE DU LOGIS BOURBON,0480,49590,49140,Fontevraud-l'Abbaye,49,,,491400000F0896,,,,,,,,,,,,,0,3,Dépendance,,0,S,sols,,,105,0.051053,47.179768
2021-842488,2021-06-08,000001,Vente,17000,50,B,RUE DU LOGIS BOURBON,0480,49590,49140,Fontevraud-l'Abbaye,49,,,491400000F0896,,,,,,,,,,,,,0,3,Dépendance,,0,S,sols,,,105,0.051053,47.179768
2021-842645,2021-06-30,000001,Vente,81000,100,,AV DES ROCHES,0670,49590,49140,Fontevraud-l'Abbaye,49,,,491400000E0120,,,,,,,,,,,,,0,1,Maison,140,7,S,sols,,,609,0.048804,47.190582
2021-842645,2021-06-30,000001,Vente,81000,100,,AV DES ROCHES,0670,49590,49140,Fontevraud-l'Abbaye,49,,,491400000E0120,,,,,,,,,,,,,0,3,Dépendance,,0,S,sols,,,609,0.048804,47.190582
2021-842645,2021-06-30,000001,Vente,81000,,,LES ROCHES,B092,49590,49140,Fontevraud-l'Abbaye,49,,,491400000E0137,,,,,,,,,,,,,0,,,,,T,terres,,,461,0.050341,47.190731
2021-842747,2021-07-19,000001,Vente,500,,,LA SOCRAIE,B095,49590,49140,Fontevraud-l'Abbaye,49,,,491400000D0233,,,,,,,,,,,,,0,,,,,S,sols,,,256,0.044074,47.188773
2021-842784,2021-07-26,000001,Vente,269000,43,,AV DES ROCHES,0670,49590,49140,Fontevraud-l'Abbaye,49,,,491400000D0654,,,,,,,,,,,,,0,1,Maison,153,5,J,jardins,POTAG,Jardin potager,644,0.048316,47.188091
2021-842784,2021-07-26,000001,Vente,269000,43,,AV DES ROCHES,0670,49590,49140,Fontevraud-l'Abbaye,49,,,491400000D0654,,,,,,,,,,,,,0,1,Maison,153,5,S,sols,,,531,0.048316,47.188091
2021-842937,2021-07-29,000001,Vente,80000,3,,RUE DE LA CITE LA LIZANDIERE,0294,49590,49140,Fontevraud-l'Abbaye,49,,,49140000ZC0230,,,,,,,,,,,,,0,1,Maison,94,5,S,sols,,,360,0.041897,47.177489
2021-843056,2021-08-31,000001,Vente,135000,,,LE PETIT PUITS,B088,49590,49140,Fontevraud-l'Abbaye,49,,,491400000C0517,,,,,,,,,,,,,0,,,,,S,sols,,,250,0.04565,47.191623
2021-843056,2021-08-31,000001,Vente,135000,20,,RUE DU PEUIL,0600,49590,49140,Fontevraud-l'Abbaye,49,,,491400000C0519,,,,,,,,,,,,,0,1,Maison,63,3,S,sols,,,1193,0.045248,47.191725
2021-843056,2021-08-31,000001,Vente,135000,20,,RUE DU PEUIL,0600,49590,49140,Fontevraud-l'Abbaye,49,,,491400000C0519,,,,,,,,,,,,,0,3,Dépendance,,0,S,sols,,,1193,0.045248,47.191725
2021-843056,2021-08-31,000001,Vente,135000,20,,RUE DU PEUIL,0600,49590,49140,Fontevraud-l'Abbaye,49,,,491400000C0519,,,,,,,,,,,,,0,3,Dépendance,,0,S,sols,,,1193,0.045248,47.191725
2021-843056,2021-08-31,000001,Vente,135000,20,,RUE DU PEUIL,0600,49590,49140,Fontevraud-l'Abbaye,49,,,491400000C0519,,,,,,,,,,,,,0,3,Dépendance,,0,S,sols,,,1193,0.045248,47.191725
2021-843056,2021-08-31,000001,Vente,135000,,,CHENE DEBLAIS,B032,49590,49140,Fontevraud-l'Abbaye,49,,,491400000C0530,,,,,,,,,,,,,0,,,,,L,landes,,,191,0.045128,47.191839
2021-843056,2021-08-31,000001,Vente,135000,,,CHENE DEBLAIS,B032,49590,49140,Fontevraud-l'Abbaye,49,,,491400000C0531,,,,,,,,,,,,,0,,,,,T,terres,,,225,0.044929,47.191623
2021-843111,2021-08-27,000001,Vente,87780,,,LE GRAND CLOS,B058,49590,49140,Fontevraud-l'Abbaye,49,,,491400000D1186,,,,,,,,,,,,,0,,,,,S,sols,,,1,0.049063,47.18275
2021-843111,2021-08-27,000001,Vente,87780,21,,RUE DES MASQUES,0540,49590,49140,Fontevraud-l'Abbaye,49,,,491400000D1192,,,,,,,,,,,,,0,1,Maison,77,3,S,sols,,,194,0.049061,47.182709
2021-843236,2021-09-03,000001,Vente,75000,21,,RUE DE LA CITE LA LIZANDIERE,0294,49590,49140,Fontevraud-l'Abbaye,49,,,491400000G0969,,,,,,,,,,,,,0,1,Maison,76,4,S,sols,,,419,0.043737,47.180049
2021-843275,2021-09-20,000001,Vente,800,,,LES ECOTERIES,B052,49590,49140,Fontevraud-l'Abbaye,49,,,491400000C0476,,,,,,,,,,,,,0,,,,,J,jardins,POTAG,Jardin potager,130,0.046929,47.19224
2021-843275,2021-09-20,000001,Vente,800,,,LES ECOTERIES,B052,49590,49140,Fontevraud-l'Abbaye,49,,,491400000C0479,,,,,,,,,,,,,0,,,,,S,sols,,,12,0.046868,47.192235
2021-843296,2021-09-07,000001,Vente,25000,17,,AV ROCHECHOUART,0660,49590,49140,Fontevraud-l'Abbaye,49,,,491400000D0757,,,,,,,,,,,,,0,1,Maison,105,3,S,sols,,,40,0.050361,47.182455
2021-843393,2021-09-07,000001,Vente,87000,4,,IMP DE BEAULIEU,0215,49590,49140,Fontevraud-l'Abbaye,49,,,491400000D0860,,,,,,,,,,,,,0,1,Maison,85,4,S,sols,,,117,0.046317,47.182014
2021-843393,2021-09-07,000001,Vente,87000,4,,IMP DE BEAULIEU,0215,49590,49140,Fontevraud-l'Abbaye,49,,,491400000D0860,,,,,,,,,,,,,0,3,Dépendance,,0,S,sols,,,117,0.046317,47.182014
2021-843666,2021-10-27,000001,Vente,87000,44,,AV DES ROCHES,0670,49590,49140,Fontevraud-l'Abbaye,49,,,491400000E0078,,,,,,,,,,,,,0,1,Maison,85,2,S,sols,,,141,0.048856,47.188127
2021-843666,2021-10-27,000001,Vente,87000,,,LES ROCHES,B092,49590,49140,Fontevraud-l'Abbaye,49,,,491400000E0083,,,,,,,,,,,,,0,,,,,J,jardins,POTAG,Jardin potager,380,0.049262,47.188483
2021-843666,2021-10-27,000001,Vente,87000,,,LES ROCHES,B092,49590,49140,Fontevraud-l'Abbaye,49,,,491400000E0084,,,,,,,,,,,,,0,,,,,J,jardins,POTAG,Jardin potager,142,0.049232,47.188616
2021-843705,2021-11-04,000002,Vente,32087.52,,,LE DAVIET,B050,49590,49140,Fontevraud-l'Abbaye,49,,,491400000B0778,,,,,,,,,,,,,0,,,,,T,terres,,,3910,0.043618,47.202266
2021-843705,2021-11-04,000002,Vente,32087.52,,,LE DAVIET,B050,49590,49140,Fontevraud-l'Abbaye,49,,,491400000B0779,,,,,,,,,,,,,0,,,,,T,terres,,,2535,0.043921,47.202005
2021-843762,2021-11-15,000001,Vente,60000,33,,AV ROCHECHOUART,0660,49590,49140,Fontevraud-l'Abbaye,49,,,491400000D0748,,,,,,,,,,,,,0,1,Maison,17,0,S,sols,,,740,0.050214,47.183316
2021-843762,2021-11-15,000001,Vente,60000,33,,AV ROCHECHOUART,0660,49590,49140,Fontevraud-l'Abbaye,49,,,491400000D0748,,,,,,,,,,,,,0,3,Dépendance,,0,S,sols,,,740,0.050214,47.183316
2021-843762,2021-11-15,000001,Vente,60000,33,,AV ROCHECHOUART,0660,49590,49140,Fontevraud-l'Abbaye,49,,,491400000D0748,,,,,,,,,,,,,0,1,Maison,57,2,S,sols,,,740,0.050214,47.183316
2021-843762,2021-11-15,000001,Vente,60000,,,AV ROCHECHOUART,0660,49590,49140,Fontevraud-l'Abbaye,49,,,491400000D1102,,,,,,,,,,,,,0,,,,,S,sols,,,49,0.05011,47.183274
2021-843776,2021-11-05,000001,Vente,155000,55,,RUE DES VARENNES,0800,49590,49140,Fontevraud-l'Abbaye,49,,,49140000ZC0030,,,,,,,,,,,,,0,1,Maison,89,4,J,jardins,POTAG,Jardin potager,1800,0.042772,47.176928
2021-843776,2021-11-05,000001,Vente,155000,55,,RUE DES VARENNES,0800,49590,49140,Fontevraud-l'Abbaye,49,,,49140000ZC0030,,,,,,,,,,,,,0,1,Maison,89,4,S,sols,,,530,0.042772,47.176928
2021-843821,2021-11-10,000001,Vente,445550,26,,RUE DES VARENNES,0800,49590,49140,Fontevraud-l'Abbaye,49,,,49140000ZC0083,,,,,,,,,,,,,0,3,Dépendance,,0,S,sols,,,1347,0.043745,47.178778
2021-843821,2021-11-10,000001,Vente,445550,26,,RUE DES VARENNES,0800,49590,49140,Fontevraud-l'Abbaye,49,,,49140000ZC0083,,,,,,,,,,,,,0,1,Maison,235,7,S,sols,,,1347,0.043745,47.178778
2021-843821,2021-11-10,000001,Vente,445550,26,,RUE DES VARENNES,0800,49590,49140,Fontevraud-l'Abbaye,49,,,49140000ZC0083,,,,,,,,,,,,,0,1,Maison,104,5,S,sols,,,1347,0.043745,47.178778
2021-843821,2021-11-10,000001,Vente,445550,,,RUE DU PRESSOIR,0630,49590,49140,Fontevraud-l'Abbaye,49,,,49140000ZC0087,,,,,,,,,,,,,0,,,,,S,sols,,,85,0.043667,47.178941
2021-843821,2021-11-10,000001,Vente,445550,,,RUE DU PRESSOIR,0630,49590,49140,Fontevraud-l'Abbaye,49,,,49140000ZC0088,,,,,,,,,,,,,0,,,,,S,sols,,,56,0.043782,47.179003
2021-843914,2021-12-10,000001,Vente,270000,55,,AV ROCHECHOUART,0660,49590,49140,Fontevraud-l'Abbaye,49,,,491400000D1278,,,,,,,,,,,,,0,4,Local industriel. commercial ou assimilé,220,0,S,sols,,,194,0.05033,47.184213
2021-843914,2021-12-10,000001,Vente,270000,49,,AV ROCHECHOUART,0660,49590,49140,Fontevraud-l'Abbaye,49,,,491400000D1328,,,,,,,,,,,,,0,,,,,S,sols,,,20,0.050389,47.184087
2021-843921,2021-12-07,000001,Vente,5000,5059,,IMP DE BEAULIEU,0215,49590,49140,Fontevraud-l'Abbaye,49,,,491400000D0498,,,,,,,,,,,,,0,3,Dépendance,,0,S,sols,,,98,0.044568,47.182469
2021-843921,2021-12-07,000001,Vente,5000,5059,,IMP DE BEAULIEU,0215,49590,49140,Fontevraud-l'Abbaye,49,,,491400000D0498,,,,,,,,,,,,,0,3,Dépendance,,0,J,jardins,POTAG,Jardin potager,270,0.044568,47.182469
2021-844049,2021-12-06,000001,Vente,80000,20,,AV DU 11 NOVEMBRE 1918,0570,49590,49140,Fontevraud-l'Abbaye,49,,,491400000G0111,,,,,,,,,,,,,0,1,Maison,58,3,S,sols,,,125,0.045908,47.180785
2021-844192,2021-12-30,000001,Vente,95000,38,,IMP DE BEAULIEU,0215,49590,49140,Fontevraud-l'Abbaye,49,,,491400000D0495,,,,,,,,,,,,,0,1,Maison,81,5,S,sols,,,755,0.044338,47.18257
2021-844203,2021-05-11,000001,Adjudication,104000,33,,RUE ROBERT D ARBRISSEL,0650,49590,49140,Fontevraud-l'Abbaye,49,,,491400000F0016,,,,,,,,,,,,,0,3,Dépendance,,0,S,sols,,,160,0.047576,47.18156
2021-844203,2021-05-11,000001,Adjudication,104000,33,,RUE ROBERT D ARBRISSEL,0650,49590,49140,Fontevraud-l'Abbaye,49,,,491400000F0016,,,,,,,,,,,,,0,1,Maison,170,7,S,sols,,,160,0.047576,47.18156
2021-844203,2021-05-11,000001,Adjudication,104000,,,RUE ROBERT D ARBRISSEL,0650,49590,49140,Fontevraud-l'Abbaye,49,,,491400000F0888,,,,,,,,,,,,,0,,,,,S,sols,,,71,0.047633,47.181482
