id_mutation,date_mutation,numero_disposition,nature_mutation,valeur_fonciere,adresse_numero,adresse_suffixe,adresse_nom_voie,adresse_code_voie,code_postal,code_commune,nom_commune,code_departement,ancien_code_commune,ancien_nom_commune,id_parcelle,ancien_id_parcelle,numero_volume,lot1_numero,lot1_surface_carrez,lot2_numero,lot2_surface_carrez,lot3_numero,lot3_surface_carrez,lot4_numero,lot4_surface_carrez,lot5_numero,lot5_surface_carrez,nombre_lots,code_type_local,type_local,surface_reelle_bati,nombre_pieces_principales,code_nature_culture,nature_culture,code_nature_culture_speciale,nature_culture_speciale,surface_terrain,longitude,latitude
2021-841088,2021-01-04,000001,Vente,155000,1,,RUE DE L AVENIR,1772,49310,49373,Lys-Haut-Layon,49,,,493730590G0738,,,,,,,,,,,,,0,1,Maison,112,5,S,sols,,,803,-0.471391,47.109521
2021-841090,2021-01-11,000001,Vente,111000,22,,RUE DU PARADIS,1817,49560,49373,Lys-Haut-Layon,49,,,49373232AC0343,,,,,,,,,,,,,0,1,Maison,98,5,S,sols,,,659,-0.369942,47.118607
2021-841104,2021-01-15,000001,Vente,130000,1,,RUE DES COUTURES,1860,49540,49373,Lys-Haut-Layon,49,,,493733480B0671,,,,,,,,,,,,,0,1,Maison,90,3,S,sols,,,1150,-0.427455,47.201883
2021-841116,2021-01-04,000001,Vente,75000,25,,RUE DE LA TOUCHE,1900,49540,49373,Lys-Haut-Layon,49,,,493733480A1848,,,,,,,,,,,,,0,,,,,S,sols,,,161,-0.443197,47.206371
2021-841116,2021-01-04,000001,Vente,75000,25,,RUE DE LA TOUCHE,1900,49540,49373,Lys-Haut-Layon,49,,,493733480A1850,,,,,,,,,,,,,0,,,,,S,sols,,,585,-0.442895,47.206356
2021-841162,2021-01-19,000001,Vente,800,2,,RUE D ANJOU TANCOIGNE,1844,49310,49373,Lys-Haut-Layon,49,,,49373342AB0521,,,,,,,,,,,,,0,,,,,J,jardins,POTAG,Jardin potager,46,-0.40922,47.173221
2021-841165,2021-01-11,000001,Vente,4009,,,LES GRANDES VIGNES,D333,49560,49373,Lys-Haut-Layon,49,,,49373232AC0527,,,,,,,,,,,,,0,,,,,T,terres,,,4453,-0.37041,47.116628
2021-841165,2021-01-11,000001,Vente,4009,,,LES GRANDES VIGNES,D333,49560,49373,Lys-Haut-Layon,49,,,493732320K1283,,,,,,,,,,,,,0,,,,,T,terres,,,3565,-0.371712,47.117218
2021-841177,2021-01-22,000001,Vente,93500,1,,VILLEGOUX,D495,49560,49373,Lys-Haut-Layon,49,,,493732320D0384,,,,,,,,,,,,,0,1,Maison,74,4,S,sols,,,3117,-0.424716,47.149805
2021-841177,2021-01-22,000001,Vente,93500,,,VILLEGOUX,D495,49560,49373,Lys-Haut-Layon,49,,,493732320D0386,,,,,,,,,,,,,0,,,,,S,sols,,,424,-0.424054,47.149426
2021-841177,2021-01-22,000001,Vente,93500,,,VILLEGOUX,D495,49560,49373,Lys-Haut-Layon,49,,,493732320D0388,,,,,,,,,,,,,0,,,,,S,sols,,,1526,-0.424671,47.149423
2021-841183,2021-01-14,000001,Vente,200,,,PIECE SAINTE ANNE,D903,49540,49373,Lys-Haut-Layon,49,,,49373348ZO0059,,,,,,,,,,,,,0,,,,,P,prés,,,5941,-0.429979,47.198539
2021-841187,2021-01-22,000001,Vente,90000,20,,RUE DE LA MARTINIERE,1040,49310,49373,Lys-Haut-Layon,49,,,49373000AM0060,,,,,,,,,,,,,0,1,Maison,84,5,S,sols,,,570,-0.534695,47.148237
2021-841189,2021-01-27,000001,Vente,31501.17,,,LES CHAMPS DE L ETANG,B261,49310,49373,Lys-Haut-Layon,49,,,49373286ZN0038,,,,,,,,,,,,,0,,,,,P,prés,,,7049,-0.597503,47.131742
2021-841192,2021-01-26,000001,Vente,37035,15,,RUE MICHEL HARDOUIN,1066,49310,49373,Lys-Haut-Layon,49,,,49373000AH0133,,,,,,,,,,,,,0,,,,,AB,terrains a bâtir,,,823,-0.538178,47.135731
2021-841209,2021-01-18,000001,Vente,60000,3,,RUE DU LIVIER,1909,49310,49373,Lys-Haut-Layon,49,,,493733560B0658,,,,,,,,,,,,,0,1,Maison,60,2,S,sols,,,140,-0.441265,47.15236
2021-841211,2021-01-29,000001,Vente,92000,3,,RUE DU COLOMBIER NUEIL S/ L,1806,49560,49373,Lys-Haut-Layon,49,,,49373232AB0114,,,,,,,,,,,,,0,1,Maison,120,4,S,sols,,,381,-0.363743,47.118497
2021-841216,2021-01-28,000001,Vente,175000,1,,SQ DES ALBIZZIAS,0050,49310,49373,Lys-Haut-Layon,49,,,49373000AE0116,,,,,,,,,,,,,0,1,Maison,103,4,S,sols,,,896,-0.53776,47.140358
2021-841219,2021-02-01,000001,Vente,77000,3,,RUE TRIPOTEAU ST HILAIRE,1675,49310,49373,Lys-Haut-Layon,49,,,49373286AV0027,,,,,,,,,,,,,0,1,Maison,113,7,S,sols,,,458,-0.552146,47.124892
2021-841243,2021-01-21,000001,Vente,96000,5,,RUE NATIONALE,1160,49310,49373,Lys-Haut-Layon,49,,,49373000AO0065,,,,,,,,,,,,,0,1,Maison,84,6,S,sols,,,637,-0.528626,47.146846
2021-841249,2021-01-27,000001,Vente,909,,,LES DURANDERIES,D815,49540,49373,Lys-Haut-Layon,49,,,49373348ZI0214,,,,,,,,,,,,,0,,,,,T,terres,,,303,-0.426627,47.202611
2021-841254,2021-02-01,000001,Vente,162000,,,RUE DU CHAPELET,0260,49310,49373,Lys-Haut-Layon,49,,,49373000AA0099,,,,,,,,,,,,,0,,,,,S,sols,,,225,-0.539555,47.143922
2021-841254,2021-02-01,000001,Vente,162000,,,RUE DU CHAPELET,0260,49310,49373,Lys-Haut-Layon,49,,,49373000AA0100,,,,,,,,,,,,,0,,,,,J,jardins,POTAG,Jardin potager,481,-0.539748,47.144058
2021-841254,2021-02-01,000001,Vente,162000,8,,RUE DE LA CURE NOTRE DAME,0580,49310,49373,Lys-Haut-Layon,49,,,49373000AA0101,,,,,,,,,,,,,0,1,Maison,115,4,S,sols,,,145,-0.539649,47.1442
2021-841255,2021-01-29,000001,Vente,30000,4,,RUE DU PONT MOREAU,1779,49310,49373,Lys-Haut-Layon,49,,,493730590D0234,,,,,,,,,,,,,0,4,Local industriel. commercial ou assimilé,40,0,S,sols,,,644,-0.468208,47.107782
2021-841255,2021-01-29,000001,Vente,30000,4,,RUE DU PONT MOREAU,1779,49310,49373,Lys-Haut-Layon,49,,,493730590D0234,,,,,,,,,,,,,0,1,Maison,99,4,S,sols,,,644,-0.468208,47.107782
2021-841255,2021-01-29,000001,Vente,30000,,,LE BOURG LES CERQUEUX SS P,C359,49310,49373,Lys-Haut-Layon,49,,,493730590D0459,,,,,,,,,,,,,0,,,,,S,sols,,,530,-0.468335,47.107885
2021-841280,2021-01-27,000001,Echange,477,,,LES DURANDERIES,D815,49540,49373,Lys-Haut-Layon,49,,,49373348ZI0207,,,,,,,,,,,,,0,,,,,T,terres,,,127,-0.427107,47.202663
2021-841280,2021-01-27,000002,Echange,477,,,LES DURANDERIES,D815,49540,49373,Lys-Haut-Layon,49,,,49373348ZI0211,,,,,,,,,,,,,0,,,,,J,jardins,POTAG,Jardin potager,159,-0.427323,47.202837
2021-841283,2021-01-25,000001,Vente,187500,17,,RUE DE LA MAIRIE LES CERQUEUX,1776,49310,49373,Lys-Haut-Layon,49,,,493730590G0285,,,,,,,,,,,,,0,1,Maison,208,11,S,sols,,,1240,-0.469496,47.109122
2021-841283,2021-01-25,000001,Vente,187500,,,LA CHENAYE,C541,49310,49373,Lys-Haut-Layon,49,,,493730590G0286,,,,,,,,,,,,,0,,,,,J,jardins,POTAG,Jardin potager,1797,-0.469955,47.108645
2021-841283,2021-01-25,000001,Vente,187500,,,LA CHENAYE,C541,49310,49373,Lys-Haut-Layon,49,,,493730590G0564,,,,,,,,,,,,,0,,,,,P,prés,,,740,-0.469757,47.109101
2021-841301,2021-02-09,000001,Vente,60000,,,LE BOURG LES CERQUEUX SS P,C359,49310,49373,Lys-Haut-Layon,49,,,493730590D0016,,,,,,,,,,,,,0,,,,,S,sols,,,343,-0.466966,47.108419
2021-841301,2021-02-09,000001,Vente,60000,9,,RUE DU PETIT ANJOU LES CERQUEU,1778,49310,49373,Lys-Haut-Layon,49,,,493730590D0017,,,,,,,,,,,,,0,1,Maison,129,6,S,sols,,,173,-0.466803,47.108229
2021-841301,2021-02-09,000001,Vente,60000,,,LE BOURG LES CERQUEUX SS P,C359,49310,49373,Lys-Haut-Layon,49,,,493730590D0018,,,,,,,,,,,,,0,,,,,S,sols,,,134,-0.466748,47.108278
2021-841302,2021-02-08,000001,Vente,79000,4,,RUE DE L ECOLE VIHIERS,0720,49310,49373,Lys-Haut-Layon,49,,,49373000AK0142,,,,,,,,,,,,,0,4,Local industriel. commercial ou assimilé,75,0,S,sols,,,65,-0.535641,47.145601
2021-841373,2021-02-12,000001,Vente,15,,,CHAMP DU MOULIN,E018,49310,49373,Lys-Haut-Layon,49,,,493733560B1537,,,,,,,,,,,,,0,,,,,T,terres,,,1121,-0.439182,47.151236
2021-841373,2021-02-12,000001,Vente,15,,,CHAMP DU MOULIN,E018,49310,49373,Lys-Haut-Layon,49,,,493733560B1552,,,,,,,,,,,,,0,,,,,T,terres,,,245,-0.43926,47.151021
2021-841373,2021-02-12,000001,Vente,15,,,CHAMP DU MOULIN,E018,49310,49373,Lys-Haut-Layon,49,,,493733560B1555,,,,,,,,,,,,,0,,,,,T,terres,,,70,-0.439255,47.150943
2021-841381,2021-01-26,000001,Vente,28000,5414,,LE BOURG NUEIL S/LAYON,D215,49560,49373,Lys-Haut-Layon,49,,,49373232AC0431,,,,,,,,,,,,,0,1,Maison,75,5,S,sols,,,236,-0.365108,47.117493
2021-841416,2021-02-18,000001,Vente,90000,9,,ALL DE LA DENIZIERE,1904,49310,49373,Lys-Haut-Layon,49,,,493733560A1262,,,,,,,,,,,,,0,1,Maison,68,3,S,sols,,,234,-0.449287,47.155827
2021-841416,2021-02-18,000001,Vente,90000,9,,ALL DE LA DENIZIERE,1904,49310,49373,Lys-Haut-Layon,49,,,493733560A1266,,,,,,,,,,,,,0,,,,,S,sols,,,24,-0.449127,47.155821
2021-841424,2021-02-24,000001,Vente,5000,,,LES QUARTS DE LA FOSSE,D925,49540,49373,Lys-Haut-Layon,49,,,49373348ZK0029,,,,,,,,,,,,,0,,,,,VI,vignes,,,4201,-0.423549,47.187093
2021-841450,2021-02-16,000001,Vente,50000,20,,RUE DU LYS,0988,49310,49373,Lys-Haut-Layon,49,,,49373379AY0123,,,,,,,,,,,,,0,1,Maison,72,2,S,sols,,,211,-0.548638,47.162508
2021-841452,2021-02-22,000001,Vente,120000,11,,LA GALINIERE,B395,49310,49373,Lys-Haut-Layon,49,,,49373286ZE0047,,,,,,,,,,,,,0,1,Maison,118,4,T,terres,,,3871,-0.520638,47.120362
2021-841452,2021-02-22,000001,Vente,120000,11,,LA GALINIERE,B395,49310,49373,Lys-Haut-Layon,49,,,49373286ZE0047,,,,,,,,,,,,,0,1,Maison,118,4,E,eaux,MARE,Mare,380,-0.520638,47.120362
2021-841452,2021-02-22,000001,Vente,120000,11,,LA GALINIERE,B395,49310,49373,Lys-Haut-Layon,49,,,49373286ZE0047,,,,,,,,,,,,,0,1,Maison,118,4,J,jardins,POTAG,Jardin potager,1000,-0.520638,47.120362
2021-841452,2021-02-22,000001,Vente,120000,11,,LA GALINIERE,B395,49310,49373,Lys-Haut-Layon,49,,,49373286ZE0047,,,,,,,,,,,,,0,1,Maison,118,4,S,sols,,,800,-0.520638,47.120362
2021-841480,2021-02-24,000001,Vente,40275,,,LA GRANDE FRELONNIERE,B490,49310,49373,Lys-Haut-Layon,49,,,493733790B1033,,,,,,,,,,,,,0,,,,,P,prés,,,23161,-0.542782,47.165275
2021-841480,2021-02-24,000001,Vente,40275,,,BLAVREUIL,B057,49310,49373,Lys-Haut-Layon,49,,,493733790B1034,,,,,,,,,,,,,0,,,,,T,terres,,,2782,-0.541967,47.165744
2021-841480,2021-02-24,000001,Vente,40275,,,COTEAU DE CHARRIERE,B302,49310,49373,Lys-Haut-Layon,49,,,493733790B1041,,,,,,,,,,,,,0,,,,,T,terres,,,792,-0.542633,47.165872
2021-841480,2021-02-24,000001,Vente,40275,,,COTEAU DE CHARRIERE,B302,49310,49373,Lys-Haut-Layon,49,,,493733790B1309,,,,,,,,,,,,,0,,,,,P,prés,,,34,-0.541242,47.167683
2021-841480,2021-02-24,000001,Vente,40275,,,BLAVREUIL,B057,49310,49373,Lys-Haut-Layon,49,,,493733790B1407,,,,,,,,,,,,,0,,,,,T,terres,,,113,-0.542129,47.166033
2021-841480,2021-02-24,000001,Vente,40275,,,BLAVREUIL,B057,49310,49373,Lys-Haut-Layon,49,,,493733790B1409,,,,,,,,,,,,,0,,,,,T,terres,,,14058,-0.541377,47.167063
2021-841480,2021-02-24,000001,Vente,40275,,,COTEAU DE CHARRIERE,B302,49310,49373,Lys-Haut-Layon,49,,,493733790B1410,,,,,,,,,,,,,0,,,,,T,terres,,,92,-0.542429,47.166132
2021-841480,2021-02-24,000001,Vente,40275,,,COTEAU DE CHARRIERE,B302,49310,49373,Lys-Haut-Layon,49,,,493733790B1412,,,,,,,,,,,,,0,,,,,T,terres,,,453,-0.541852,47.166704
2021-841480,2021-02-24,000001,Vente,40275,,,COTEAU DE CHARRIERE,B302,49310,49373,Lys-Haut-Layon,49,,,493733790B1450,,,,,,,,,,,,,0,,,,,S,sols,,,4500,-0.542529,47.166605
2021-841480,2021-02-24,000001,Vente,40275,,,COTEAU DE CHARRIERE,B302,49310,49373,Lys-Haut-Layon,49,,,493733790B1450,,,,,,,,,,,,,0,,,,,P,prés,,,6707,-0.542529,47.166605
2021-841481,2021-02-19,000001,Vente,28000,8,,RUE DE LA MAIRIE NUEIL S/L,1807,49560,49373,Lys-Haut-Layon,49,,,49373232AC0105,,,,,,,,,,,,,0,1,Maison,94,4,S,sols,,,158,-0.366269,47.117312
2021-841501,2021-02-25,000001,Vente,12488.3,,,LES QUARTS,D166,49540,49373,Lys-Haut-Layon,49,,,49373142ZD0064,,,,,,,,,,,,,0,,,,,VI,vignes,,,28256,-0.457769,47.167318
2021-841501,2021-02-25,000001,Vente,12488.3,,,BOIS DE TIGNE,D984,49310,49373,Lys-Haut-Layon,49,,,493733560A0270,,,,,,,,,,,,,0,,,,,T,terres,,,8250,-0.45916,47.162685
2021-841501,2021-02-25,000001,Vente,12488.3,,,LES BOUVARDS,D998,49310,49373,Lys-Haut-Layon,49,,,493733560A1088,,,,,,,,,,,,,0,,,,,VI,vignes,,,2636,-0.457836,47.15935
2021-841501,2021-02-25,000001,Vente,12488.3,,,LES BOUVARDS,D998,49310,49373,Lys-Haut-Layon,49,,,493733560A1090,,,,,,,,,,,,,0,,,,,T,terres,,,2414,-0.458919,47.159869
2021-841502,2021-02-04,000001,Vente,60000,,,LE PETIT PRE,C834,49310,49373,Lys-Haut-Layon,49,,,493730590G0111,,,,,,,,,,,,,0,,,,,P,prés,,,2235,-0.477971,47.115214
2021-841502,2021-02-04,000001,Vente,60000,,,LE PRE DE COUSSE,C938,49310,49373,Lys-Haut-Layon,49,,,493730590G0112,,,,,,,,,,,,,0,,,,,P,prés,,,3815,-0.47748,47.115704
2021-841502,2021-02-04,000001,Vente,60000,,,L OUCHE,C761,49310,49373,Lys-Haut-Layon,49,,,493730590G0113,,,,,,,,,,,,,0,,,,,T,terres,,,925,,
2021-841502,2021-02-04,000001,Vente,60000,4,,COUSSE,C318,49310,49373,Lys-Haut-Layon,49,,,493730590G0114,,,,,,,,,,,,,0,1,Maison,80,3,S,sols,,,944,-0.477908,47.115807
2021-841502,2021-02-04,000001,Vente,60000,,,COUSSE,C318,49310,49373,Lys-Haut-Layon,49,,,493730590G0115,,,,,,,,,,,,,0,,,,,T,terres,,,1780,,
2021-841503,2021-02-25,000001,Vente,15145.2,,,LES QUARTS,D166,49540,49373,Lys-Haut-Layon,49,,,49373142ZD0064,,,,,,,,,,,,,0,,,,,VI,vignes,,,28256,-0.457769,47.167318
2021-841503,2021-02-25,000001,Vente,15145.2,,,LES BOUVARDS,D998,49310,49373,Lys-Haut-Layon,49,,,493733560A1088,,,,,,,,,,,,,0,,,,,VI,vignes,,,2636,-0.457836,47.15935
2021-841503,2021-02-25,000001,Vente,15145.2,,,LES BOUVARDS,D998,49310,49373,Lys-Haut-Layon,49,,,493733560A1090,,,,,,,,,,,,,0,,,,,T,terres,,,2414,-0.458919,47.159869
2021-841518,2021-03-05,000001,Vente,10000,5241,,CHE DU BUISSON,0152,49310,49373,Lys-Haut-Layon,49,,,49373379AY0030,,,,,,,,,,,,,0,3,Dépendance,,0,S,sols,,,83,-0.548028,47.163053
2021-841520,2021-03-05,000001,Vente,150000,6,,RUE DE SAINT HILAIRE,1480,49310,49373,Lys-Haut-Layon,49,,,49373000AA0181,,,,,,,,,,,,,0,1,Maison,130,7,S,sols,,,866,-0.542656,47.143619
2021-841542,2021-03-11,000001,Vente,162500,79,,RUE NATIONALE,1160,49310,49373,Lys-Haut-Layon,49,,,49373000AA0268,,,,,,,,,,,,,0,,,,,S,sols,,,6,-0.543111,47.14444
2021-841542,2021-03-11,000001,Vente,162500,79,,RUE NATIONALE,1160,49310,49373,Lys-Haut-Layon,49,,,49373000AA0270,,,,,,,,,,,,,0,,,,,S,sols,,,63,-0.543144,47.144432
2021-841542,2021-03-11,000001,Vente,162500,83,,RUE NATIONALE,1160,49310,49373,Lys-Haut-Layon,49,,,49373000AA0272,,,,,,,,,,,,,0,4,Local industriel. commercial ou assimilé,196,0,S,sols,,,736,-0.543267,47.144323
2021-841542,2021-03-11,000001,Vente,162500,85,,RUE NATIONALE,1160,49310,49373,Lys-Haut-Layon,49,,,49373000AA0296,,,,,,,,,,,,,0,,,,,S,sols,,,71,-0.543493,47.144236
2021-841542,2021-03-11,000001,Vente,162500,,,RUE NATIONALE,1160,49310,49373,Lys-Haut-Layon,49,,,49373000AA0298,,,,,,,,,,,,,0,,,,,S,sols,,,57,-0.543296,47.144166
2021-841554,2021-03-11,000001,Vente,116160,1,,RUE JEAN NICOLAS STOFFLET,0909,49310,49373,Lys-Haut-Layon,49,,,49373000AH0178,,,,,,,,,,,,,0,,,,,S,sols,,,21,-0.538921,47.139333
2021-841554,2021-03-11,000001,Vente,116160,3,,RUE JEAN NICOLAS STOFFLET,0909,49310,49373,Lys-Haut-Layon,49,,,49373000AH0180,,,,,,,,,,,,,0,1,Maison,80,4,S,sols,,,254,-0.538788,47.13932
2021-841555,2021-03-12,000001,Vente,1000,,,RUE DU FAUBOURG NOTRE DAME,0760,49310,49373,Lys-Haut-Layon,49,,,49373000AA0054,,,,,,,,,,,,,0,,,,,J,jardins,POTAG,Jardin potager,254,-0.536691,47.144305
2021-841628,2021-03-19,000001,Vente,86290,50,B,RUE NATIONALE,1160,49310,49373,Lys-Haut-Layon,49,,,49373000AL0187,,,,,,,,,,,,,0,1,Maison,75,3,S,sols,,,83,-0.537259,47.146233
2021-841631,2021-03-16,000001,Vente,35000,,,BOIS DES PRES GASNIERS,D207,49560,49373,Lys-Haut-Layon,49,,,493732320E0817,,,,,,,,,,,,,0,,,,,BT,taillis simples,,,2200,-0.413538,47.140979
2021-841631,2021-03-16,000001,Vente,35000,,,BOIS DES PRES GASNIERS,D207,49560,49373,Lys-Haut-Layon,49,,,493732320E0819,,,,,,,,,,,,,0,,,,,BT,taillis simples,,,3300,-0.413067,47.140698
2021-841631,2021-03-16,000001,Vente,35000,5,,RTE DE LAIGNE,1841,49560,49373,Lys-Haut-Layon,49,,,493732320K0642,,,,,,,,,,,,,0,1,Maison,65,2,S,sols,,,900,-0.364188,47.108181
2021-841658,2021-03-16,000001,Vente,90000,14,,RUE DE LA MAIRIE NUEIL S/L,1807,49560,49373,Lys-Haut-Layon,49,,,49373232AC0102,,,,,,,,,,,,,0,1,Maison,128,5,S,sols,,,925,-0.366582,47.117228
2021-841659,2021-03-16,000001,Vente,39825,10,,RUE JEAN FALLOUX,0910,49310,49373,Lys-Haut-Layon,49,,,49373000AH0149,,,,,,,,,,,,,0,,,,,AB,terrains a bâtir,,,885,-0.538114,47.136385
2021-841660,2021-03-17,000001,Vente,130000,16,,RUE DE CHANTOISEAU,0247,49310,49373,Lys-Haut-Layon,49,,,49373286AR0045,,,,,,,,,,,,,0,1,Maison,105,5,S,sols,,,605,-0.527645,47.14177
2021-841660,2021-03-17,000001,Vente,130000,16,,RUE DE CHANTOISEAU,0247,49310,49373,Lys-Haut-Layon,49,,,49373286AR0046,,,,,,,,,,,,,0,,,,,AG,terrains d'agrément,,,445,-0.527991,47.14178
2021-841679,2021-03-30,000001,Vente,48700,15,,RUE DU PETIT ANJOU LES CERQUEU,1778,49310,49373,Lys-Haut-Layon,49,,,493730590D0027,,,,,,,,,,,,,0,1,Maison,79,4,S,sols,,,965,-0.465895,47.108967
2021-841694,2021-03-22,000001,Vente,106000,27,,RUE DU LYS,0988,49310,49373,Lys-Haut-Layon,49,,,49373379AY0059,,,,,,,,,,,,,0,1,Maison,130,3,S,sols,,,321,-0.546626,47.161764
2021-841694,2021-03-22,000001,Vente,106000,,,LE BOURG DU VOIDE,B094,49310,49373,Lys-Haut-Layon,49,,,49373379AY0095,,,,,,,,,,,,,0,,,,,J,jardins,POTAG,Jardin potager,747,-0.546074,47.161248
2021-841726,2021-03-16,000001,Vente,4500,,,LA COGNEE,D807,49540,49373,Lys-Haut-Layon,49,,,49373348ZR0058,,,,,,,,,,,,,0,,,,,VI,vignes,,,6400,-0.452189,47.197347
2021-841739,2021-04-02,000001,Vente,195000,,,LE GAS GUITTON,C603,49310,49373,Lys-Haut-Layon,49,,,493730590E0217,,,,,,,,,,,,,0,,,,,E,eaux,MARE,Mare,565,-0.486814,47.087627
2021-841739,2021-04-02,000001,Vente,195000,,,LE GAS GUITTON,C603,49310,49373,Lys-Haut-Layon,49,,,493730590E0218,,,,,,,,,,,,,0,,,,,J,jardins,POTAG,Jardin potager,850,-0.486658,47.087791
2021-841739,2021-04-02,000001,Vente,195000,,,PTE OUCHE DE LA COUR,C873,49310,49373,Lys-Haut-Layon,49,,,493730590E0231,,,,,,,,,,,,,0,,,,,T,terres,,,1585,-0.486207,47.087788
2021-841739,2021-04-02,000001,Vente,195000,,,LE BAS GUITTON,C319,49310,49373,Lys-Haut-Layon,49,,,493730590E0346,,,,,,,,,,,,,0,,,,,S,sols,,,340,-0.486557,47.087969
2021-841739,2021-04-02,000001,Vente,195000,,,LE BAS GUITTON,C319,49310,49373,Lys-Haut-Layon,49,,,493730590E0381,,,,,,,,,,,,,0,,,,,S,sols,,,663,-0.486922,47.087957
2021-841739,2021-04-02,000001,Vente,195000,,,LA GRANDE OUCHE DE LA COU,C675,49310,49373,Lys-Haut-Layon,49,,,493730590E0434,,,,,,,,,,,,,0,,,,,P,prés,,,1874,-0.48674,47.087469
2021-841739,2021-04-02,000001,Vente,195000,5,,LE GAS GUITTON,C603,49310,49373,Lys-Haut-Layon,49,,,493730590E0438,,,,,,,,,,,,,0,1,Maison,300,5,S,sols,,,4081,-0.487253,47.087678
2021-841741,2021-04-02,000001,Vente,1,,,CHAMP DU MOULIN,E018,49310,49373,Lys-Haut-Layon,49,,,493733560B1478,,,,,,,,,,,,,0,,,,,T,terres,,,3555,-0.437757,47.150637
2021-841741,2021-04-02,000001,Vente,1,,,CHAMP DU MOULIN,E018,49310,49373,Lys-Haut-Layon,49,,,493733560B1550,,,,,,,,,,,,,0,,,,,T,terres,,,8149,-0.437625,47.15102
2021-841741,2021-04-02,000001,Vente,1,,,CHAMP DU MOULIN,E018,49310,49373,Lys-Haut-Layon,49,,,493733560B1554,,,,,,,,,,,,,0,,,,,T,terres,,,113,-0.438399,47.150597
2021-841741,2021-04-02,000001,Vente,1,,,CHAMP DU MOULIN,E018,49310,49373,Lys-Haut-Layon,49,,,493733560B1671,,,,,,,,,,,,,0,,,,,T,terres,,,70,-0.439427,47.151081
2021-841741,2021-04-02,000001,Vente,1,,,CHAMP DU MOULIN,E018,49310,49373,Lys-Haut-Layon,49,,,493733560B1672,,,,,,,,,,,,,0,,,,,T,terres,,,2569,-0.439724,47.150962
2021-841754,2021-04-02,000001,Vente,1,,,LE PETIT VIHIERS,B820,49310,49373,Lys-Haut-Layon,49,,,49373000AN0076,,,,,,,,,,,,,0,,,,,AB,terrains a bâtir,,,7895,-0.525229,47.149214
2021-841754,2021-04-02,000001,Vente,1,,,LE PETIT VIHIERS,B820,49310,49373,Lys-Haut-Layon,49,,,49373000AN0077,,,,,,,,,,,,,0,,,,,S,sols,,,1174,-0.525083,47.149375
2021-841754,2021-04-02,000001,Vente,1,,,LA LOGE VIHIERS,B607,49310,49373,Lys-Haut-Layon,49,,,49373000AN0078,,,,,,,,,,,,,0,,,,,T,terres,,,6983,-0.524914,47.149574
2021-841754,2021-04-02,000001,Vente,1,,,LA LOGE VIHIERS,B607,49310,49373,Lys-Haut-Layon,49,,,49373000AN0087,,,,,,,,,,,,,0,,,,,T,terres,,,920,,
2021-841754,2021-04-02,000001,Vente,1,,,LA LOGE VIHIERS,B607,49310,49373,Lys-Haut-Layon,49,,,49373000AN0088,,,,,,,,,,,,,0,,,,,T,terres,,,9506,,
2021-841754,2021-04-02,000001,Vente,1,,,LA LOGE VIHIERS,B607,49310,49373,Lys-Haut-Layon,49,,,49373000AN0145,,,,,,,,,,,,,0,,,,,T,terres,,,3790,-0.522881,47.1494
2021-841754,2021-04-02,000001,Vente,1,,,LE PETIT VIHIERS,B820,49310,49373,Lys-Haut-Layon,49,,,49373000AN0147,,,,,,,,,,,,,0,,,,,T,terres,,,1402,-0.523301,47.149104
2021-841754,2021-04-02,000001,Vente,1,,,LE PETIT VIHIERS,B820,49310,49373,Lys-Haut-Layon,49,,,49373000AN0149,,,,,,,,,,,,,0,,,,,T,terres,,,194,-0.521823,47.149524
2021-841754,2021-04-02,000001,Vente,1,,,LA LOGE VIHIERS,B607,49310,49373,Lys-Haut-Layon,49,,,49373000AN0163,,,,,,,,,,,,,0,,,,,T,terres,,,10038,,
2021-841754,2021-04-02,000001,Vente,1,,,LA LOGE VIHIERS,B607,49310,49373,Lys-Haut-Layon,49,,,49373000ZA0046,,,,,,,,,,,,,0,,,,,T,terres,,,1600,-0.521505,47.151124
2021-841754,2021-04-02,000001,Vente,1,,,LA LOGE VIHIERS,B607,49310,49373,Lys-Haut-Layon,49,,,49373000ZA0047,,,,,,,,,,,,,0,,,,,T,terres,,,12428,,
2021-841758,2021-04-07,000001,Vente,25000,,,LES DURANDERIES,D815,49540,49373,Lys-Haut-Layon,49,,,49373348ZI0213,,,,,,,,,,,,,0,,,,,T,terres,,,1242,-0.426605,47.202819
2021-841768,2021-04-07,000001,Vente,25000,,,LES DURANDERIES,D815,49540,49373,Lys-Haut-Layon,49,,,49373348ZI0212,,,,,,,,,,,,,0,,,,,T,terres,,,1385,-0.426648,47.202939
2021-841773,2021-04-09,000001,Vente,10000,,,LES DURANDERIES,D815,49540,49373,Lys-Haut-Layon,49,,,493733480B0772,,,,,,,,,,,,,0,,,,,S,sols,,,538,-0.427443,47.202255
2021-841784,2021-03-19,000001,Vente,4517.1,,,LE CLOS DES VOLAGES,D112,49540,49373,Lys-Haut-Layon,49,,,49373142ZB0011,,,,,,,,,,,,,0,,,,,T,terres,,,7528,-0.424483,47.176149
2021-841784,2021-03-19,000001,Vente,4517.1,,,LE CLOS DES VOLAGES,D112,49540,49373,Lys-Haut-Layon,49,,,49373142ZB0011,,,,,,,,,,,,,0,,,,,T,terres,,,7529,-0.424483,47.176149
2021-841800,2021-04-02,000001,Vente,18496.8,,,CHAMP DU MOULIN,E018,49310,49373,Lys-Haut-Layon,49,,,493733560B1672,,,,,,,,,,,,,0,,,,,T,terres,,,2569,-0.439724,47.150962
2021-841824,2021-03-25,000001,Vente,143500,9,,RUE DU PARADIS,1817,49560,49373,Lys-Haut-Layon,49,,,49373232AC0046,,,,,,,,,,,,,0,1,Maison,128,5,S,sols,,,1314,-0.367873,47.117973
2021-841831,2021-03-30,000001,Vente,6277,,,CHAMP FLEURY,D787,49540,49373,Lys-Haut-Layon,49,,,49373348ZS0118,,,,,,,,,,,,,0,,,,,T,terres,,,4988,-0.461632,47.199153
2021-841831,2021-03-30,000001,Vente,6277,,,CHAMP FLEURY,D787,49540,49373,Lys-Haut-Layon,49,,,49373348ZS0121,,,,,,,,,,,,,0,,,,,T,terres,,,15936,-0.461509,47.198487
2021-841835,2021-03-26,000001,Vente,139017.61,1,,POIZARD,D431,49560,49373,Lys-Haut-Layon,49,,,49373232YI0073,,,,,,,,,,,,,0,1,Maison,82,3,S,sols,,,5085,-0.424288,47.129518
2021-841835,2021-03-26,000001,Vente,139017.61,1,,POIZARD,D431,49560,49373,Lys-Haut-Layon,49,,,49373232YI0073,,,,,,,,,,,,,0,1,Maison,82,3,J,jardins,POTAG,Jardin potager,1800,-0.424288,47.129518
2021-841835,2021-03-26,000001,Vente,139017.61,1,,POIZARD,D431,49560,49373,Lys-Haut-Layon,49,,,49373232YI0073,,,,,,,,,,,,,0,1,Maison,82,3,T,terres,,,3624,-0.424288,47.129518
2021-841845,2021-04-02,000001,Vente,10000,5402,,CARREFOUR DE LA CROIX ROUG,D223,49560,49373,Lys-Haut-Layon,49,,,49373232AC0097,,,,,,,,,,,,,0,1,Maison,75,2,S,sols,,,363,-0.366981,47.117159
2021-841858,2021-03-31,000001,Vente,80000,,,MAISON DES LANDES,D867,49540,49373,Lys-Haut-Layon,49,,,49373348ZR0143,,,,,,,,,,,,,0,,,,,S,sols,,,2637,-0.467614,47.19063
2021-841859,2021-03-31,000002,Vente,340000,5303,,LES LANDES TIGNE,D947,49540,49373,Lys-Haut-Layon,49,,,49373348ZR0139,,,,,,,,,,,,,0,1,Maison,106,6,S,sols,,,1809,-0.467774,47.19056
2021-841859,2021-03-31,000002,Vente,340000,,,LES GRANDS CHAMPS,D839,49540,49373,Lys-Haut-Layon,49,,,49373348ZR0144,,,,,,,,,,,,,0,,,,,S,sols,,,1272,-0.468179,47.19081
2021-841864,2021-04-14,000001,Vente,70400,4,,RUE BEAUREPAIRE,0140,49310,49373,Lys-Haut-Layon,49,,,49373000AK0136,,,,,,,,,,,,,0,,,,,S,sols,,,145,-0.535318,47.145376
2021-841867,2021-03-31,000001,Vente,219000,3,,RUE DES GRANDES ROCHES,0901,49310,49373,Lys-Haut-Layon,49,,,493733790B1357,,,,,,,,,,,,,0,1,Maison,111,5,S,sols,,,959,-0.542325,47.160178
2021-841871,2021-04-01,000001,Vente,6292.32,,,CLOS DE CHATRIGNE,D246,49560,49373,Lys-Haut-Layon,49,,,49373232ZK0031,,,,,,,,,,,,,0,,,,,T,terres,,,9939,-0.353626,47.149236
2021-841871,2021-04-01,000001,Vente,6292.32,,,CLOS DE CHATRIGNE,D246,49560,49373,Lys-Haut-Layon,49,,,49373232ZK0032,,,,,,,,,,,,,0,,,,,T,terres,,,6359,-0.352604,47.149322