id_mutation,date_mutation,numero_disposition,nature_mutation,valeur_fonciere,adresse_numero,adresse_suffixe,adresse_nom_voie,adresse_code_voie,code_postal,code_commune,nom_commune,code_departement,ancien_code_commune,ancien_nom_commune,id_parcelle,ancien_id_parcelle,numero_volume,lot1_numero,lot1_surface_carrez,lot2_numero,lot2_surface_carrez,lot3_numero,lot3_surface_carrez,lot4_numero,lot4_surface_carrez,lot5_numero,lot5_surface_carrez,nombre_lots,code_type_local,type_local,surface_reelle_bati,nombre_pieces_principales,code_nature_culture,nature_culture,code_nature_culture_speciale,nature_culture_speciale,surface_terrain,longitude,latitude
2021-852195,2021-02-02,000001,Vente,8143.1,,,L AMBESNERIE,B001,50200,50092,Cambernon,50,,,50092000AM0146,,,,,,,,,,,,,0,,,,,P,prés,,,11633,-1.390699,49.079864
2021-852316,2021-02-11,000001,Vente,207000,5137,,LA TETE DE VEE,B076,50200,50092,Cambernon,50,,,50092000ZA0045,,,,,,,,,,,,,0,1,Maison,100,4,J,jardins,,,1200,-1.411445,49.077348
2021-852316,2021-02-11,000001,Vente,207000,5137,,LA TETE DE VEE,B076,50200,50092,Cambernon,50,,,50092000ZA0045,,,,,,,,,,,,,0,1,Maison,77,3,S,sols,,,1000,-1.411445,49.077348
2021-852316,2021-02-11,000001,Vente,207000,5137,,LA TETE DE VEE,B076,50200,50092,Cambernon,50,,,50092000ZA0045,,,,,,,,,,,,,0,1,Maison,100,4,P,prés,,,516,-1.411445,49.077348
2021-852316,2021-02-11,000001,Vente,207000,5137,,LA TETE DE VEE,B076,50200,50092,Cambernon,50,,,50092000ZA0045,,,,,,,,,,,,,0,1,Maison,77,3,P,prés,,,516,-1.411445,49.077348
2021-852316,2021-02-11,000001,Vente,207000,5137,,LA TETE DE VEE,B076,50200,50092,Cambernon,50,,,50092000ZA0045,,,,,,,,,,,,,0,1,Maison,100,4,S,sols,,,1000,-1.411445,49.077348
2021-852316,2021-02-11,000001,Vente,207000,5137,,LA TETE DE VEE,B076,50200,50092,Cambernon,50,,,50092000ZA0045,,,,,,,,,,,,,0,1,Maison,77,3,J,jardins,,,1200,-1.411445,49.077348
2021-852510,2021-03-11,000001,Vente,420000,,,LE BOURG,B012,50200,50092,Cambernon,50,,,50092000AN0088,,,,,,,,,,,,,0,,,,,AG,terrains d'agrément,,,242,-1.384717,49.079482
2021-852510,2021-03-11,000001,Vente,420000,,,LE BOURG,B012,50200,50092,Cambernon,50,,,50092000AN0089,,,,,,,,,,,,,0,,,,,AG,terrains d'agrément,,,928,-1.38482,49.079642
2021-852510,2021-03-11,000001,Vente,420000,1,,LE BOURG,B012,50200,50092,Cambernon,50,,,50092000AN0147,,,,,,,,,,,,,0,1,Maison,350,6,S,sols,,,358,-1.385003,49.079914
2021-852510,2021-03-11,000001,Vente,420000,,,LE BOURG,B012,50200,50092,Cambernon,50,,,50092000AN0198,,,,,,,,,,,,,0,,,,,S,sols,,,789,-1.385289,49.079849
2021-852510,2021-03-11,000001,Vente,420000,,,LE BOURG,B012,50200,50092,Cambernon,50,,,50092000AN0204,,,,,,,,,,,,,0,,,,,AB,terrains a bâtir,,,1427,-1.385042,49.079529
2021-853838,2021-06-09,000001,Vente,26000,,,LA CHALERIE,B019,50200,50092,Cambernon,50,,,50092000AE0169,,,,,,,,,,,,,0,,,,,PP,prés plantes,,,1225,-1.365868,49.084874
2021-853838,2021-06-09,000001,Vente,26000,,,LA CHALERIE,B019,50200,50092,Cambernon,50,,,50092000AE0196,,,,,,,,,,,,,0,,,,,S,sols,,,37,-1.366253,49.085064
2021-853838,2021-06-09,000001,Vente,26000,,,LA CHALERIE,B019,50200,50092,Cambernon,50,,,50092000AE0272,,,,,,,,,,,,,0,,,,,S,sols,,,25,-1.365464,49.085033
2021-853838,2021-06-09,000001,Vente,26000,5063,,LA CHALERIE,B019,50200,50092,Cambernon,50,,,50092000AE0279,,,,,,,,,,,,,0,3,Dépendance,,0,S,sols,,,1139,-1.365723,49.085043
2021-853838,2021-06-09,000001,Vente,26000,5063,,LA CHALERIE,B019,50200,50092,Cambernon,50,,,50092000AE0279,,,,,,,,,,,,,0,1,Maison,100,5,S,sols,,,1139,-1.365723,49.085043
2021-853838,2021-06-09,000001,Vente,26000,,,LA CHALERIE,B019,50200,50092,Cambernon,50,,,50092000AE0280,,,,,,,,,,,,,0,,,,,S,sols,,,95,-1.366164,49.085068
2021-855199,2021-06-29,000001,Vente,152000,,,LE CHATEAU,B021,50200,50092,Cambernon,50,,,50092000AN0047,,,,,,,,,,,,,0,,,,,P,prés,,,2773,-1.384092,49.081373
2021-855199,2021-06-29,000001,Vente,152000,,,LE CHATEAU,B021,50200,50092,Cambernon,50,,,50092000AN0048,,,,,,,,,,,,,0,,,,,S,sols,,,45,-1.383968,49.081563
2021-855199,2021-06-29,000001,Vente,152000,23,,LE BOURG,B012,50200,50092,Cambernon,50,,,50092000AN0049,,,,,,,,,,,,,0,1,Maison,127,6,S,sols,,,1147,-1.383944,49.08116
2021-856192,2021-07-08,000001,Vente,80000,,,VILLAGE BURNEL,B082,50200,50092,Cambernon,50,,,50092000AH0179,,,,,,,,,,,,,0,,,,,S,sols,,,639,-1.365331,49.072835
2021-856192,2021-07-08,000001,Vente,80000,5039,A,VILLAGE BURNEL,B082,50200,50092,Cambernon,50,,,50092000AH0180,,,,,,,,,,,,,0,1,Maison,80,3,S,sols,,,152,-1.365336,49.072685
2021-856192,2021-07-08,000001,Vente,80000,5039,,VILLAGE BURNEL,B082,50200,50092,Cambernon,50,,,50092000AH0181,,,,,,,,,,,,,0,1,Maison,72,4,S,sols,,,198,-1.365487,49.072661
2021-856192,2021-07-08,000001,Vente,80000,,,VILLAGE BURNEL,B082,50200,50092,Cambernon,50,,,50092000AH0238,,,,,,,,,,,,,0,,,,,S,sols,,,463,-1.365101,49.073008
2021-856192,2021-07-08,000001,Vente,80000,,,VILLAGE BURNEL,B082,50200,50092,Cambernon,50,,,50092000AH0241,,,,,,,,,,,,,0,,,,,J,jardins,,,67,-1.365219,49.072759
2021-856192,2021-07-08,000001,Vente,80000,,,VILLAGE BURNEL,B082,50200,50092,Cambernon,50,,,50092000AH0265,,,,,,,,,,,,,0,,,,,P,prés,,,3270,-1.365487,49.073091
2021-856394,2021-07-23,000001,Vente,107500,5071,,LE HUTREL,B052,50200,50092,Cambernon,50,,,50092000AD0280,,,,,,,,,,,,,0,3,Dépendance,,0,S,sols,,,1109,-1.350413,49.094873
2021-856394,2021-07-23,000001,Vente,107500,5071,,LE HUTREL,B052,50200,50092,Cambernon,50,,,50092000AD0280,,,,,,,,,,,,,0,1,Maison,109,5,S,sols,,,1109,-1.350413,49.094873
2021-856419,2021-07-09,000001,Vente,97000,5022,,LA PETITE BRUYERE,B067,50200,50092,Cambernon,50,,,50092000ZA0036,,,,,,,,,,,,,0,1,Maison,70,4,S,sols,,,1049,-1.410563,49.06874
2021-856419,2021-07-09,000001,Vente,97000,,,LA PETITE BRUYERE,B067,50200,50092,Cambernon,50,,,50092000ZA0052,,,,,,,,,,,,,0,,,,,PP,prés plantes,,,1421,-1.41078,49.068384
2021-856419,2021-07-09,000001,Vente,97000,,,LA PETITE BRUYERE,B067,50200,50092,Cambernon,50,,,50092000ZA0052,,,,,,,,,,,,,0,,,,,P,prés,,,2764,-1.41078,49.068384
2021-856512,2021-07-23,000001,Vente,139000,5051,A,LA BRETONNIERE,B014,50200,50092,Cambernon,50,,,50092000AH0172,,,,,,,,,,,,,0,1,Maison,88,5,P,prés,,,1346,-1.362904,49.073503
2021-856512,2021-07-23,000001,Vente,139000,5051,A,LA BRETONNIERE,B014,50200,50092,Cambernon,50,,,50092000AH0172,,,,,,,,,,,,,0,1,Maison,88,5,J,jardins,,,862,-1.362904,49.073503
2021-856512,2021-07-23,000001,Vente,139000,5051,A,LA BRETONNIERE,B014,50200,50092,Cambernon,50,,,50092000AH0172,,,,,,,,,,,,,0,1,Maison,88,5,S,sols,,,588,-1.362904,49.073503
2021-856585,2021-07-13,000001,Vente,10438,,,LA VATELIERE,B080,50200,50092,Cambernon,50,,,50092000AE0119,,,,,,,,,,,,,0,,,,,P,prés,,,2171,-1.355598,49.083416
2021-856585,2021-07-13,000001,Vente,10438,,,LA VATELIERE,B080,50200,50092,Cambernon,50,,,50092000AE0124,,,,,,,,,,,,,0,,,,,P,prés,,,12022,-1.355934,49.082353
2021-856585,2021-07-13,000001,Vente,10438,,,LA VATELIERE,B080,50200,50092,Cambernon,50,,,50092000AE0125,,,,,,,,,,,,,0,,,,,P,prés,,,3854,-1.356585,49.082236
2021-856585,2021-07-13,000001,Vente,10438,,,LA VATELIERE,B080,50200,50092,Cambernon,50,,,50092000AE0131,,,,,,,,,,,,,0,,,,,P,prés,,,3544,-1.35658,49.083109
2021-856645,2021-07-16,000001,Vente,209000,5174,A,L HOTEL HEBERT,B050,50200,50092,Cambernon,50,,,50092000AO0080,,,,,,,,,,,,,0,3,Dépendance,,0,AG,terrains d'agrément,,,3042,-1.382573,49.0912
2021-856645,2021-07-16,000001,Vente,209000,5174,A,L HOTEL HEBERT,B050,50200,50092,Cambernon,50,,,50092000AO0080,,,,,,,,,,,,,0,1,Maison,111,4,AG,terrains d'agrément,,,3042,-1.382573,49.0912
2021-856645,2021-07-16,000001,Vente,209000,5174,A,L HOTEL HEBERT,B050,50200,50092,Cambernon,50,,,50092000AO0080,,,,,,,,,,,,,0,3,Dépendance,,0,S,sols,,,500,-1.382573,49.0912
2021-856645,2021-07-16,000001,Vente,209000,5174,A,L HOTEL HEBERT,B050,50200,50092,Cambernon,50,,,50092000AO0080,,,,,,,,,,,,,0,1,Maison,111,4,S,sols,,,500,-1.382573,49.0912
2021-856950,2021-07-20,000001,Vente,85000,,,LA HARDELIERE,B039,50200,50092,Cambernon,50,,,50092000AH0012,,,,,,,,,,,,,0,,,,,P,prés,,,396,-1.366498,49.079423
2021-856950,2021-07-20,000001,Vente,85000,5057,,LA HARDELIERE,B039,50200,50092,Cambernon,50,,,50092000AH0013,,,,,,,,,,,,,0,3,Dépendance,,0,S,sols,,,280,-1.366362,49.079474
2021-856950,2021-07-20,000001,Vente,85000,5057,,LA HARDELIERE,B039,50200,50092,Cambernon,50,,,50092000AH0013,,,,,,,,,,,,,0,1,Maison,111,5,S,sols,,,280,-1.366362,49.079474
2021-856950,2021-07-20,000001,Vente,85000,5057,,LA HARDELIERE,B039,50200,50092,Cambernon,50,,,50092000AH0013,,,,,,,,,,,,,0,3,Dépendance,,0,S,sols,,,280,-1.366362,49.079474
2021-856950,2021-07-20,000001,Vente,85000,,,LA HARDELIERE,B039,50200,50092,Cambernon,50,,,50092000AH0016,,,,,,,,,,,,,0,,,,,P,prés,,,1186,-1.365769,49.07922
2021-856950,2021-07-20,000001,Vente,85000,,,LA HARDELIERE,B039,50200,50092,Cambernon,50,,,50092000AH0017,,,,,,,,,,,,,0,,,,,P,prés,,,158,-1.365661,49.079302
2021-856950,2021-07-20,000001,Vente,85000,,,LA HARDELIERE,B039,50200,50092,Cambernon,50,,,50092000AH0018,,,,,,,,,,,,,0,,,,,S,sols,,,160,-1.365668,49.079447
2021-857669,2021-08-23,000002,Vente,10000,,,LA PLAIRIE,B068,50200,50092,Cambernon,50,,,50092000AM0304,,,,,,,,,,,,,0,,,,,P,prés,,,290,-1.406053,49.080867
2021-858025,2021-08-25,000001,Vente,5000,,,L HOTEL HEBERT,B050,50200,50092,Cambernon,50,,,50092000AO0082,,,,,,,,,,,,,0,,,,,PP,prés plantes,,,3715,-1.382354,49.090325
2021-858025,2021-08-25,000001,Vente,5000,,,L HOTEL HEBERT,B050,50200,50092,Cambernon,50,,,50092000AO0083,,,,,,,,,,,,,0,,,,,S,sols,,,161,-1.382979,49.090265
2021-858383,2021-08-16,000001,Vente,1000,,,LE BUCHEUX,B016,50200,50092,Cambernon,50,,,50092000AD0074,,,,,,,,,,,,,0,,,,,P,prés,,,2117,-1.350424,49.097284
2021-858383,2021-08-16,000001,Vente,1000,,,LE BUCHEUX,B016,50200,50092,Cambernon,50,,,50092000AD0077,,,,,,,,,,,,,0,,,,,S,sols,,,90,-1.350128,49.097124
2021-858383,2021-08-16,000001,Vente,1000,,,LE BUCHEUX,B016,50200,50092,Cambernon,50,,,50092000AD0078,,,,,,,,,,,,,0,,,,,J,jardins,,,632,-1.350514,49.096934
2021-858413,2021-09-15,000001,Vente,325000,41,,LE BOURG,B012,50200,50092,Cambernon,50,,,50092000AN0168,,,,,,,,,,,,,0,1,Maison,164,3,S,sols,,,500,-1.383496,49.08272
2021-858413,2021-09-15,000001,Vente,325000,41,,LE BOURG,B012,50200,50092,Cambernon,50,,,50092000AN0168,,,,,,,,,,,,,0,1,Maison,164,3,AG,terrains d'agrément,,,1034,-1.383496,49.08272
2021-858550,2021-08-31,000001,Vente,4500,,,L HOTEL HOMMERIL,B051,50200,50092,Cambernon,50,,,50092000AE0028,,,,,,,,,,,,,0,,,,,P,prés,,,1960,-1.364361,49.087064
2021-858550,2021-08-31,000001,Vente,4500,,,LA CROIX GENET,B027,50200,50092,Cambernon,50,,,50092000AE0164,,,,,,,,,,,,,0,,,,,P,prés,,,5345,-1.365698,49.082642
2021-858550,2021-08-31,000001,Vente,4500,,,LA CHALERIE,B019,50200,50092,Cambernon,50,,,50092000AE0175,,,,,,,,,,,,,0,,,,,BT,taillis simples,,,609,-1.36424,49.085834
2021-858550,2021-08-31,000001,Vente,4500,,,LA CHALERIE,B019,50200,50092,Cambernon,50,,,50092000AE0266,,,,,,,,,,,,,0,,,,,P,prés,,,682,-1.367754,49.085792
2021-859090,2021-09-30,000001,Vente,245000,5001,,L AUBRIERE,B002,50200,50092,Cambernon,50,,,50092000ZB0125,,,,,,,,,,,,,0,1,Maison,97,5,AG,terrains d'agrément,,,1394,-1.407671,49.064526
2021-859090,2021-09-30,000001,Vente,245000,5001,,L AUBRIERE,B002,50200,50092,Cambernon,50,,,50092000ZB0125,,,,,,,,,,,,,0,1,Maison,97,5,S,sols,,,500,-1.407671,49.064526
2021-859692,2021-10-01,000001,Vente,81500,,,L AUBRIERE,B002,50200,50092,Cambernon,50,,,50092000ZB0028,,,,,,,,,,,,,0,,,,,S,sols,,,108,-1.408139,49.062285
2021-859692,2021-10-01,000001,Vente,81500,4,,L AUBRIERE,B002,50200,50092,Cambernon,50,,,50092000ZB0029,,,,,,,,,,,,,0,1,Maison,90,4,S,sols,,,102,-1.408175,49.062421
2021-859692,2021-10-01,000001,Vente,81500,4,,L AUBRIERE,B002,50200,50092,Cambernon,50,,,50092000ZB0029,,,,,,,,,,,,,0,1,Maison,102,4,S,sols,,,102,-1.408175,49.062421
2021-860595,2021-10-22,000001,Vente,20000,,,LE GEORGET,B033,50200,50092,Cambernon,50,,,50092000AP0098,,,,,,,,,,,,,0,,,,,S,sols,,,2000,-1.392595,49.085944
2021-860595,2021-10-22,000001,Vente,20000,,,LE GEORGET,B033,50200,50092,Cambernon,50,,,50092000AP0098,,,,,,,,,,,,,0,,,,,P,prés,,,2373,-1.392595,49.085944
2021-860595,2021-10-22,000001,Vente,20000,,,LE GEORGET,B033,50200,50092,Cambernon,50,,,50092000AP0099,,,,,,,,,,,,,0,,,,,P,prés,,,4131,-1.392128,49.086176
2021-860595,2021-10-22,000001,Vente,20000,,,LE GEORGET,B033,50200,50092,Cambernon,50,,,50092000AP0099,,,,,,,,,,,,,0,,,,,S,sols,,,500,-1.392128,49.086176
2021-860595,2021-10-22,000001,Vente,20000,,,LE GEORGET,B033,50200,50092,Cambernon,50,,,50092000AP0118,,,,,,,,,,,,,0,,,,,P,prés,,,24280,-1.392791,49.084818
2021-860595,2021-10-22,000001,Vente,20000,,,LE GEORGET,B033,50200,50092,Cambernon,50,,,50092000AP0118,,,,,,,,,,,,,0,,,,,S,sols,,,5500,-1.392791,49.084818
2021-862209,2021-11-24,000001,Vente,,,,LA FROUAISE,B032,50200,50092,Cambernon,50,,,50092000AE0234,,,,,,,,,,,,,0,,,,,S,sols,,,500,-1.371209,49.083743
2021-862209,2021-11-24,000001,Vente,,,,LA FROUAISE,B032,50200,50092,Cambernon,50,,,50092000AE0234,,,,,,,,,,,,,0,,,,,P,prés,,,5316,-1.371209,49.083743
2021-862209,2021-11-24,000001,Vente,,,,LA FROUAISE,B032,50200,50092,Cambernon,50,,,50092000AE0300,,,,,,,,,,,,,0,,,,,P,prés,,,7634,-1.372219,49.0837
2021-862210,2021-11-24,000002,Vente,7900,,,LA FROUAISE,B032,50200,50092,Cambernon,50,,,50092000AE0234,,,,,,,,,,,,,0,,,,,S,sols,,,500,-1.371209,49.083743
2021-862210,2021-11-24,000002,Vente,7900,,,LA FROUAISE,B032,50200,50092,Cambernon,50,,,50092000AE0234,,,,,,,,,,,,,0,,,,,P,prés,,,5316,-1.371209,49.083743
2021-862210,2021-11-24,000002,Vente,7900,,,LA FROUAISE,B032,50200,50092,Cambernon,50,,,50092000AE0300,,,,,,,,,,,,,0,,,,,P,prés,,,7634,-1.372219,49.0837
2021-862654,2021-12-10,000001,Vente,3500,,,LE BOURG LAISNEY,B013,50200,50092,Cambernon,50,,,50092000AP0141,,,,,,,,,,,,,0,,,,,P,prés,,,13436,-1.402546,49.085883
