id_mutation,date_mutation,numero_disposition,nature_mutation,valeur_fonciere,adresse_numero,adresse_suffixe,adresse_nom_voie,adresse_code_voie,code_postal,code_commune,nom_commune,code_departement,ancien_code_commune,ancien_nom_commune,id_parcelle,ancien_id_parcelle,numero_volume,lot1_numero,lot1_surface_carrez,lot2_numero,lot2_surface_carrez,lot3_numero,lot3_surface_carrez,lot4_numero,lot4_surface_carrez,lot5_numero,lot5_surface_carrez,nombre_lots,code_type_local,type_local,surface_reelle_bati,nombre_pieces_principales,code_nature_culture,nature_culture,code_nature_culture_speciale,nature_culture_speciale,surface_terrain,longitude,latitude
2021-850302,2021-03-24,000001,Vente,36000,2,,RUE ANTOINE ET MARIE LATREILLE,0050,50670,50144,Coulouvray-Boisbenâtre,50,,,50144000AH0041,,,,,,,,,,,,,0,3,Dépendance,,0,S,sols,,,90,-1.109104,48.786977
2021-850302,2021-03-24,000001,Vente,36000,2,,RUE ANTOINE ET MARIE LATREILLE,0050,50670,50144,Coulouvray-Boisbenâtre,50,,,50144000AH0041,,,,,,,,,,,,,0,1,Maison,92,4,S,sols,,,90,-1.109104,48.786977
2021-850302,2021-03-24,000001,Vente,36000,8,,RUE AMAND MARTINET,0075,50670,50144,Coulouvray-Boisbenâtre,50,,,50144000AH0069,,,,,,,,,,,,,0,,,,,S,sols,,,487,-1.107496,48.787274
2021-850338,2021-03-23,000001,Vente,10000,,,LA MARCELLIERE,B052,50670,50144,Coulouvray-Boisbenâtre,50,,,50144000AT0021,,,,,,,,,,,,,0,,,,,T,terres,,,5017,-1.128887,48.793066
2021-850338,2021-03-23,000001,Vente,10000,,,LA MARCELLIERE,B052,50670,50144,Coulouvray-Boisbenâtre,50,,,50144000AT0038,,,,,,,,,,,,,0,,,,,E,eaux,MARE,Mare,847,-1.130142,48.793876
2021-850338,2021-03-23,000001,Vente,10000,,,LA MARCELLIERE,B052,50670,50144,Coulouvray-Boisbenâtre,50,,,50144000AT0039,,,,,,,,,,,,,0,,,,,P,prés,,,3630,-1.129783,48.793876
2021-850338,2021-03-23,000001,Vente,10000,,,LES BOUTS,B013,50670,50144,Coulouvray-Boisbenâtre,50,,,50144000AT0214,,,,,,,,,,,,,0,,,,,P,prés,,,12823,-1.135835,48.791433
2021-853619,2021-05-25,000001,Vente,7000,,,LA GUILLERIE,B037,50670,50144,Coulouvray-Boisbenâtre,50,,,50144000AP0173,,,,,,,,,,,,,0,,,,,P,prés,,,4800,-1.111044,48.774869
2021-853619,2021-05-25,000001,Vente,7000,,,LA GUILLERIE,B037,50670,50144,Coulouvray-Boisbenâtre,50,,,50144000AP0174,,,,,,,,,,,,,0,,,,,P,prés,,,738,-1.110419,48.774899
2021-853619,2021-05-25,000001,Vente,7000,,,LA GUILLERIE,B037,50670,50144,Coulouvray-Boisbenâtre,50,,,50144000AP0397,,,,,,,,,,,,,0,,,,,VE,vergers,,,819,-1.108653,48.774329
2021-853619,2021-05-25,000001,Vente,7000,,,LA GUILLERIE,B037,50670,50144,Coulouvray-Boisbenâtre,50,,,50144000AP0401,,,,,,,,,,,,,0,,,,,P,prés,,,10238,-1.109694,48.774563
2021-854873,2021-06-29,000002,Vente,62000,36,,RUE ANTOINE ET MARIE LATREILLE,0050,50670,50144,Coulouvray-Boisbenâtre,50,,,50144000AH0006,,,,,,,,,,,,,0,1,Maison,54,3,S,sols,,,284,-1.111014,48.787691
2021-854873,2021-06-29,000002,Vente,62000,36,,RUE ANTOINE ET MARIE LATREILLE,0050,50670,50144,Coulouvray-Boisbenâtre,50,,,50144000AH0006,,,,,,,,,,,,,0,4,Local industriel. commercial ou assimilé,709,0,S,sols,,,284,-1.111014,48.787691
2021-854873,2021-06-29,000002,Vente,62000,,,LE BOURG,B012,50670,50144,Coulouvray-Boisbenâtre,50,,,50144000AH0281,,,,,,,,,,,,,0,,,,,S,sols,,,168,-1.110815,48.787664
2021-854873,2021-06-29,000002,Vente,62000,,,RUE DES AUMONES,0004,50670,50144,Coulouvray-Boisbenâtre,50,,,50144000AH0284,,,,,,,,,,,,,0,,,,,S,sols,,,140,-1.110959,48.787776
2021-854873,2021-06-29,000002,Vente,62000,,,LE BOURG,B012,50670,50144,Coulouvray-Boisbenâtre,50,,,50144000AH0306,,,,,,,,,,,,,0,,,,,J,jardins,,,274,-1.110788,48.787536
2021-856545,2021-07-09,000001,Vente,118000,,,LE BOURG,B012,50670,50144,Coulouvray-Boisbenâtre,50,,,50144000AH0121,,,,,,,,,,,,,0,,,,,S,sols,,,18,-1.11122,48.785849
2021-856545,2021-07-09,000001,Vente,118000,,,LE BOURG,B012,50670,50144,Coulouvray-Boisbenâtre,50,,,50144000AH0122,,,,,,,,,,,,,0,,,,,VE,vergers,,,1031,-1.111093,48.785798
2021-856545,2021-07-09,000001,Vente,118000,10,,RUE GEORGES BLIN,0006,50670,50144,Coulouvray-Boisbenâtre,50,,,50144000AH0123,,,,,,,,,,,,,0,1,Maison,100,4,S,sols,,,1134,-1.111116,48.785537
2021-856545,2021-07-09,000001,Vente,118000,,,LE BOURG,B012,50670,50144,Coulouvray-Boisbenâtre,50,,,50144000AH0286,,,,,,,,,,,,,0,,,,,T,terres,,,1413,-1.111258,48.785276
2021-856545,2021-07-09,000001,Vente,118000,,,LE BOURG,B012,50670,50144,Coulouvray-Boisbenâtre,50,,,50144000AH0286,,,,,,,,,,,,,0,,,,,S,sols,,,500,-1.111258,48.785276
2021-856545,2021-07-09,000001,Vente,118000,,,RUE GEORGES BLIN,0006,50670,50144,Coulouvray-Boisbenâtre,50,,,50144000AH0288,,,,,,,,,,,,,0,,,,,S,sols,,,157,-1.111117,48.785416
2021-856550,2021-07-09,000002,Vente,100,,,LA MOCHONNIERE,B055,50670,50144,Coulouvray-Boisbenâtre,50,,,50144000AP0409,,,,,,,,,,,,,0,,,,,S,sols,,,42,-1.121738,48.771259
2021-856551,2021-07-09,000001,Vente,100000,,,LA MOCHONNIERE,B055,50670,50144,Coulouvray-Boisbenâtre,50,,,50144000AP0348,,,,,,,,,,,,,0,,,,,S,sols,,,11,-1.122586,48.771232
2021-856551,2021-07-09,000001,Vente,100000,,,LA MOCHONNIERE,B055,50670,50144,Coulouvray-Boisbenâtre,50,,,50144000AP0349,,,,,,,,,,,,,0,,,,,VE,vergers,,,1580,-1.12239,48.77121
2021-856551,2021-07-09,000001,Vente,100000,27,,RUE DES ETAMEURS,0008,50670,50144,Coulouvray-Boisbenâtre,50,,,50144000AP0385,,,,,,,,,,,,,0,3,Dépendance,,0,S,sols,,,677,-1.121895,48.77119
2021-856551,2021-07-09,000001,Vente,100000,27,,RUE DES ETAMEURS,0008,50670,50144,Coulouvray-Boisbenâtre,50,,,50144000AP0385,,,,,,,,,,,,,0,1,Maison,94,5,S,sols,,,677,-1.121895,48.77119
2021-856551,2021-07-09,000001,Vente,100000,,,LA MOCHONNIERE,B055,50670,50144,Coulouvray-Boisbenâtre,50,,,50144000AP0409,,,,,,,,,,,,,0,,,,,S,sols,,,42,-1.121738,48.771259
2021-858193,2021-08-27,000001,Vente,100000,,,LA FAUCAUNNIERE,B029,50670,50144,Coulouvray-Boisbenâtre,50,,,50144000AS0099,,,,,,,,,,,,,0,,,,,VE,vergers,,,1290,-1.114986,48.788533
2021-858193,2021-08-27,000001,Vente,100000,55,,RUE ANTOINE ET MARIE LATREILLE,0050,50670,50144,Coulouvray-Boisbenâtre,50,,,50144000AS0100,,,,,,,,,,,,,0,1,Maison,30,1,S,sols,,,590,-1.115172,48.788595
2021-858193,2021-08-27,000001,Vente,100000,,,LA FAUCAUNNIERE,B029,50670,50144,Coulouvray-Boisbenâtre,50,,,50144000AS0297,,,,,,,,,,,,,0,,,,,T,terres,,,200,-1.115265,48.788687
2021-858280,2021-09-10,000001,Vente,58870,,,LE BOURG,B012,50670,50144,Coulouvray-Boisbenâtre,50,,,50144000AH0149,,,,,,,,,,,,,0,,,,,S,sols,,,18,-1.110578,48.786437
2021-858280,2021-09-10,000001,Vente,58870,,,LE BOURG,B012,50670,50144,Coulouvray-Boisbenâtre,50,,,50144000AH0150,,,,,,,,,,,,,0,,,,,J,jardins,,,379,-1.11063,48.786653
2021-858280,2021-09-10,000001,Vente,58870,,,LE BOURG,B012,50670,50144,Coulouvray-Boisbenâtre,50,,,50144000AH0151,,,,,,,,,,,,,0,,,,,J,jardins,,,429,-1.110545,48.786762
2021-858280,2021-09-10,000001,Vente,58870,13,,RUE ANTOINE ET MARIE LATREILLE,0050,50670,50144,Coulouvray-Boisbenâtre,50,,,50144000AH0157,,,,,,,,,,,,,0,1,Maison,144,8,S,sols,,,378,-1.110687,48.787014
2021-858818,2021-09-16,000001,Vente,4000,,,LA SAGERIE,B071,50670,50144,Coulouvray-Boisbenâtre,50,,,50144000AL0279,,,,,,,,,,,,,0,,,,,P,prés,,,4088,-1.081851,48.770854
2021-859731,2021-10-01,000001,Vente,135000,,,LA CHEVALLERIE,B019,50670,50144,Coulouvray-Boisbenâtre,50,,,50144000AL0149,,,,,,,,,,,,,0,,,,,S,sols,,,34,-1.071204,48.771598
2021-859731,2021-10-01,000001,Vente,135000,,,LA CHEVALLERIE,B019,50670,50144,Coulouvray-Boisbenâtre,50,,,50144000AL0150,,,,,,,,,,,,,0,,,,,S,sols,,,32,-1.071456,48.771917
2021-859731,2021-10-01,000001,Vente,135000,16,,RUE JEAN-MARIE FOUREL,0015,50670,50144,Coulouvray-Boisbenâtre,50,,,50144000AL0151,,,,,,,,,,,,,0,3,Dépendance,,0,S,sols,,,100,-1.071193,48.771927
2021-859731,2021-10-01,000001,Vente,135000,16,,RUE JEAN-MARIE FOUREL,0015,50670,50144,Coulouvray-Boisbenâtre,50,,,50144000AL0151,,,,,,,,,,,,,0,1,Maison,99,3,S,sols,,,100,-1.071193,48.771927
2021-859731,2021-10-01,000001,Vente,135000,16,,RUE JEAN-MARIE FOUREL,0015,50670,50144,Coulouvray-Boisbenâtre,50,,,50144000AL0151,,,,,,,,,,,,,0,3,Dépendance,,0,S,sols,,,100,-1.071193,48.771927
2021-859731,2021-10-01,000001,Vente,135000,,,LA CHEVALLERIE,B019,50670,50144,Coulouvray-Boisbenâtre,50,,,50144000AL0152,,,,,,,,,,,,,0,,,,,VE,vergers,,,2695,-1.07122,48.771785
2021-860664,2021-10-16,000001,Vente,150000,,,LA TOUCHE,B075,50670,50144,Coulouvray-Boisbenâtre,50,,,50144000AO0167,,,,,,,,,,,,,0,,,,,BT,taillis simples,,,1490,-1.099477,48.770273
2021-860664,2021-10-16,000001,Vente,150000,,,LA TOUCHE,B075,50670,50144,Coulouvray-Boisbenâtre,50,,,50144000AO0171,,,,,,,,,,,,,0,,,,,T,terres,,,12890,-1.101113,48.769744
2021-860664,2021-10-16,000001,Vente,150000,,,LA TOUCHE,B075,50670,50144,Coulouvray-Boisbenâtre,50,,,50144000AO0172,,,,,,,,,,,,,0,,,,,T,terres,,,3670,-1.100407,48.769922
2021-860664,2021-10-16,000001,Vente,150000,,,LA TOUCHE,B075,50670,50144,Coulouvray-Boisbenâtre,50,,,50144000AO0173,,,,,,,,,,,,,0,,,,,P,prés,,,2505,-1.099827,48.769781
2021-860664,2021-10-16,000001,Vente,150000,,,LA TOUCHE,B075,50670,50144,Coulouvray-Boisbenâtre,50,,,50144000AO0174,,,,,,,,,,,,,0,,,,,P,prés,,,2530,-1.099905,48.769215
2021-860664,2021-10-16,000001,Vente,150000,,,LA TOUCHE,B075,50670,50144,Coulouvray-Boisbenâtre,50,,,50144000AO0175,,,,,,,,,,,,,0,,,,,T,terres,,,420,-1.099823,48.768881
2021-860664,2021-10-16,000001,Vente,150000,,,LA TOUCHE,B075,50670,50144,Coulouvray-Boisbenâtre,50,,,50144000AO0176,,,,,,,,,,,,,0,,,,,BT,taillis simples,,,1450,-1.099504,48.769488
2021-860664,2021-10-16,000001,Vente,150000,,,LA TOUCHE,B075,50670,50144,Coulouvray-Boisbenâtre,50,,,50144000AO0177,,,,,,,,,,,,,0,,,,,T,terres,,,1140,-1.099682,48.768843
2021-860664,2021-10-16,000001,Vente,150000,,,LA TOUCHE,B075,50670,50144,Coulouvray-Boisbenâtre,50,,,50144000AO0178,,,,,,,,,,,,,0,,,,,T,terres,,,1858,-1.099832,48.768189
2021-860664,2021-10-16,000001,Vente,150000,,,LA TOUCHE,B075,50670,50144,Coulouvray-Boisbenâtre,50,,,50144000AO0179,,,,,,,,,,,,,0,,,,,S,sols,,,32,-1.099707,48.768154
2021-860664,2021-10-16,000001,Vente,150000,,,LA TOUCHE,B075,50670,50144,Coulouvray-Boisbenâtre,50,,,50144000AO0180,,,,,,,,,,,,,0,,,,,P,prés,,,4595,-1.100004,48.76741
2021-860664,2021-10-16,000001,Vente,150000,,,LA TOUCHE,B075,50670,50144,Coulouvray-Boisbenâtre,50,,,50144000AO0181,,,,,,,,,,,,,0,,,,,P,prés,,,2440,-1.100557,48.76786
2021-860664,2021-10-16,000001,Vente,150000,40,,RUE GEORGES BLIN,0006,50670,50144,Coulouvray-Boisbenâtre,50,,,50144000AO0182,,,,,,,,,,,,,0,1,Maison,28,1,S,sols,,,499,-1.100241,48.768364
2021-860664,2021-10-16,000001,Vente,150000,40,,RUE GEORGES BLIN,0006,50670,50144,Coulouvray-Boisbenâtre,50,,,50144000AO0182,,,,,,,,,,,,,0,3,Dépendance,,0,S,sols,,,499,-1.100241,48.768364
2021-860664,2021-10-16,000001,Vente,150000,,,LA TOUCHE,B075,50670,50144,Coulouvray-Boisbenâtre,50,,,50144000AO0183,,,,,,,,,,,,,0,,,,,S,sols,,,27,-1.10088,48.768788
2021-860664,2021-10-16,000001,Vente,150000,,,LA TOUCHE,B075,50670,50144,Coulouvray-Boisbenâtre,50,,,50144000AO0184,,,,,,,,,,,,,0,,,,,P,prés,,,9378,-1.100443,48.768757
2021-861550,2021-11-15,000001,Vente,8000,,,BELLEVUE,B006,50670,50144,Coulouvray-Boisbenâtre,50,,,50144000AK0214,,,,,,,,,,,,,0,,,,,BT,taillis simples,,,1715,-1.091218,48.778911
2021-861550,2021-11-15,000001,Vente,8000,,,BELLEVUE,B006,50670,50144,Coulouvray-Boisbenâtre,50,,,50144000AK0215,,,,,,,,,,,,,0,,,,,T,terres,,,8590,-1.090976,48.77929
2021-861768,2021-11-29,000002,Vente,31000,,,L OURIE,B062,50670,50144,Coulouvray-Boisbenâtre,50,,,50144000AR0025,,,,,,,,,,,,,0,,,,,T,terres,,,6935,-1.133456,48.78147
2021-861768,2021-11-29,000002,Vente,31000,,,L OURIE,B062,50670,50144,Coulouvray-Boisbenâtre,50,,,50144000AR0063,,,,,,,,,,,,,0,,,,,P,prés,,,1140,-1.131713,48.775183
2021-861768,2021-11-29,000002,Vente,31000,,,LA HERISSIERE,B045,50670,50144,Coulouvray-Boisbenâtre,50,,,50144000AR0108,,,,,,,,,,,,,0,,,,,S,sols,,,45,-1.127706,48.775402
2021-861768,2021-11-29,000002,Vente,31000,,,LA HERISSIERE,B045,50670,50144,Coulouvray-Boisbenâtre,50,,,50144000AR0110,,,,,,,,,,,,,0,,,,,S,sols,,,16,-1.12758,48.774993
2021-861768,2021-11-29,000002,Vente,31000,,,LA HERISSIERE,B045,50670,50144,Coulouvray-Boisbenâtre,50,,,50144000AR0111,,,,,,,,,,,,,0,,,,,S,sols,,,5,-1.127306,48.775075
2021-861768,2021-11-29,000002,Vente,31000,,,LA HERISSIERE,B045,50670,50144,Coulouvray-Boisbenâtre,50,,,50144000AR0112,,,,,,,,,,,,,0,,,,,S,sols,,,436,-1.126889,48.775212
2021-861768,2021-11-29,000002,Vente,31000,,,LA HERISSIERE,B045,50670,50144,Coulouvray-Boisbenâtre,50,,,50144000AR0212,,,,,,,,,,,,,0,,,,,T,terres,,,5071,-1.124066,48.776895
2021-861768,2021-11-29,000002,Vente,31000,,,LA HERISSIERE,B045,50670,50144,Coulouvray-Boisbenâtre,50,,,50144000AR0214,,,,,,,,,,,,,0,,,,,T,terres,,,929,-1.124457,48.777426
2021-861768,2021-11-29,000002,Vente,31000,,,LA HERISSIERE,B045,50670,50144,Coulouvray-Boisbenâtre,50,,,50144000AR0217,,,,,,,,,,,,,0,,,,,S,sols,,,564,-1.125638,48.775824
2021-861768,2021-11-29,000002,Vente,31000,,,LA HERISSIERE,B045,50670,50144,Coulouvray-Boisbenâtre,50,,,50144000AR0217,,,,,,,,,,,,,0,,,,,T,terres,,,23530,-1.125638,48.775824
2021-861768,2021-11-29,000002,Vente,31000,,,L OURIE,B062,50670,50144,Coulouvray-Boisbenâtre,50,,,50144000AR0222,,,,,,,,,,,,,0,,,,,T,terres,,,5351,-1.134227,48.781537
2021-861768,2021-11-29,000002,Vente,31000,,,L OURIE,B062,50670,50144,Coulouvray-Boisbenâtre,50,,,50144000AR0224,,,,,,,,,,,,,0,,,,,T,terres,,,4730,-1.134302,48.782336
2021-861768,2021-11-29,000002,Vente,31000,,,LA HERISSIERE,B045,50670,50144,Coulouvray-Boisbenâtre,50,,,50144000AR0231,,,,,,,,,,,,,0,,,,,P,prés,,,5419,-1.127476,48.775142
2021-861768,2021-11-29,000002,Vente,31000,,,LA HERISSIERE,B045,50670,50144,Coulouvray-Boisbenâtre,50,,,50144000AR0231,,,,,,,,,,,,,0,,,,,S,sols,,,1190,-1.127476,48.775142
2021-861768,2021-11-29,000002,Vente,31000,,,LA HERISSIERE,B045,50670,50144,Coulouvray-Boisbenâtre,50,,,50144000AR0233,,,,,,,,,,,,,0,,,,,T,terres,,,2156,-1.127324,48.775826
2021-861769,2021-11-29,000001,Vente,40000,,,LA HERISSIERE,B045,50670,50144,Coulouvray-Boisbenâtre,50,,,50144000AR0103,,,,,,,,,,,,,0,,,,,S,sols,,,12,-1.128223,48.775108
2021-861769,2021-11-29,000001,Vente,40000,,,LA HERISSIERE,B045,50670,50144,Coulouvray-Boisbenâtre,50,,,50144000AR0105,,,,,,,,,,,,,0,,,,,S,sols,,,18,-1.12858,48.775319
2021-861769,2021-11-29,000001,Vente,40000,44,,RUE DES ETAMEURS,0008,50670,50144,Coulouvray-Boisbenâtre,50,,,50144000AR0106,,,,,,,,,,,,,0,1,Maison,63,2,S,sols,,,196,-1.128161,48.7753
2021-861769,2021-11-29,000001,Vente,40000,,,LA HERISSIERE,B045,50670,50144,Coulouvray-Boisbenâtre,50,,,50144000AR0109,,,,,,,,,,,,,0,,,,,S,sols,,,18,-1.127667,48.775168
2021-861769,2021-11-29,000001,Vente,40000,,,LA HERISSIERE,B045,50670,50144,Coulouvray-Boisbenâtre,50,,,50144000AR0230,,,,,,,,,,,,,0,,,,,P,prés,,,2597,-1.12826,48.775276
2021-861769,2021-11-29,000001,Vente,40000,,,LA HERISSIERE,B045,50670,50144,Coulouvray-Boisbenâtre,50,,,50144000AR0232,,,,,,,,,,,,,0,,,,,T,terres,,,256,-1.127752,48.775788
2021-862336,2021-11-25,000001,Vente,63000,29,,RUE GEORGES BLIN,0006,50670,50144,Coulouvray-Boisbenâtre,50,,,50144000AI0010,,,,,,,,,,,,,0,1,Maison,60,1,S,sols,,,177,-1.106229,48.777349
2021-862336,2021-11-25,000001,Vente,63000,,,LE CRUCHET,B025,50670,50144,Coulouvray-Boisbenâtre,50,,,50144000AI0011,,,,,,,,,,,,,0,,,,,VE,vergers,,,1590,-1.106082,48.777312
2021-862336,2021-11-25,000001,Vente,63000,,,LE CRUCHET,B025,50670,50144,Coulouvray-Boisbenâtre,50,,,50144000AI0011,,,,,,,,,,,,,0,,,,,S,sols,,,323,-1.106082,48.777312
2021-862336,2021-11-25,000001,Vente,63000,,,LE CRUCHET,B025,50670,50144,Coulouvray-Boisbenâtre,50,,,50144000AI0241,,,,,,,,,,,,,0,,,,,VE,vergers,,,1053,-1.10655,48.777187
2021-862364,2021-11-30,000001,Vente,6000,,,LA COUR,B023,50670,50144,Coulouvray-Boisbenâtre,50,,,50144000AP0251,,,,,,,,,,,,,0,,,,,VE,vergers,,,3690,-1.110549,48.770964
2021-862364,2021-11-30,000001,Vente,6000,5,,RUE DE L ETANG,0009,50670,50144,Coulouvray-Boisbenâtre,50,,,50144000AP0252,,,,,,,,,,,,,0,1,Maison,40,2,S,sols,,,114,-1.110524,48.770853
2021-862373,2021-11-26,000001,Vente,33000,,,LE BOURG,B012,50670,50144,Coulouvray-Boisbenâtre,50,,,50144000AH0025,,,,,,,,,,,,,0,,,,,S,sols,,,100,-1.109146,48.78769
2021-862373,2021-11-26,000001,Vente,33000,,,LE BOURG,B012,50670,50144,Coulouvray-Boisbenâtre,50,,,50144000AH0025,,,,,,,,,,,,,0,,,,,J,jardins,,,196,-1.109146,48.78769
2021-862373,2021-11-26,000001,Vente,33000,15,,RUE JEAN HUET,0048,50670,50144,Coulouvray-Boisbenâtre,50,,,50144000AH0038,,,,,,,,,,,,,0,1,Maison,60,3,S,sols,,,54,-1.109224,48.787153
2021-862392,2021-11-25,000001,Vente,3000,,,LE CRUCHET,B025,50670,50144,Coulouvray-Boisbenâtre,50,,,50144000AI0008,,,,,,,,,,,,,0,,,,,S,sols,,,37,-1.106701,48.777314
2021-862392,2021-11-25,000001,Vente,3000,,,LE CRUCHET,B025,50670,50144,Coulouvray-Boisbenâtre,50,,,50144000AI0242,,,,,,,,,,,,,0,,,,,VE,vergers,,,273,-1.106639,48.777327
2021-863180,2021-12-07,000001,Vente,108500,,,LA MOTTE,B057,50670,50144,Coulouvray-Boisbenâtre,50,,,50144000AE0029,,,,,,,,,,,,,0,,,,,J,jardins,,,920,-1.10847,48.790183
2021-863180,2021-12-07,000001,Vente,108500,12,,RUE JEAN HUET,0048,50670,50144,Coulouvray-Boisbenâtre,50,,,50144000AE0030,,,,,,,,,,,,,0,3,Dépendance,,0,S,sols,,,923,-1.108874,48.790054
2021-863180,2021-12-07,000001,Vente,108500,12,,RUE JEAN HUET,0048,50670,50144,Coulouvray-Boisbenâtre,50,,,50144000AE0030,,,,,,,,,,,,,0,1,Maison,130,3,S,sols,,,923,-1.108874,48.790054
2021-863180,2021-12-07,000001,Vente,108500,,,RUE JEAN HUET,0048,50670,50144,Coulouvray-Boisbenâtre,50,,,50144000AE0258,,,,,,,,,,,,,0,,,,,S,sols,,,172,-1.108993,48.78987
2021-863374,2021-12-21,000001,Vente,15000,46,,RUE DES ETAMEURS,0008,50670,50144,Coulouvray-Boisbenâtre,50,,,50144000AR0107,,,,,,,,,,,,,0,1,Maison,20,1,S,sols,,,42,-1.127992,48.775658
2021-863374,2021-12-21,000001,Vente,15000,,,LA HERISSIERE,B045,50670,50144,Coulouvray-Boisbenâtre,50,,,50144000AR0215,,,,,,,,,,,,,0,,,,,T,terres,,,1380,-1.128154,48.77559
2021-863374,2021-12-21,000001,Vente,15000,,,LA HERISSIERE,B045,50670,50144,Coulouvray-Boisbenâtre,50,,,50144000AR0219,,,,,,,,,,,,,0,,,,,T,terres,,,148,-1.127831,48.775775
2021-863449,2021-12-30,000001,Vente,108000,5,,RUE DES LAVANDIERES,0055,50670,50144,Coulouvray-Boisbenâtre,50,,,50144000AH0141,,,,,,,,,,,,,0,1,Maison,36,4,S,sols,,,621,-1.111971,48.785906
2021-863449,2021-12-30,000001,Vente,108000,,,LE BOURG,B012,50670,50144,Coulouvray-Boisbenâtre,50,,,50144000AH0204,,,,,,,,,,,,,0,,,,,S,sols,,,10,-1.112275,48.785645
2021-863449,2021-12-30,000001,Vente,108000,,,LE BOURG,B012,50670,50144,Coulouvray-Boisbenâtre,50,,,50144000AH0269,,,,,,,,,,,,,0,,,,,VE,vergers,,,1079,-1.112132,48.785754
2021-863998,2021-12-23,000001,Vente,91800,50,A,RUE JEAN HUET,0048,50670,50144,Coulouvray-Boisbenâtre,50,,,50144000AC0031,,,,,,,,,,,,,0,1,Maison,35,2,S,sols,,,84,-1.109499,48.810859
2021-863998,2021-12-23,000001,Vente,91800,50,,RUE JEAN HUET,0048,50670,50144,Coulouvray-Boisbenâtre,50,,,50144000AC0032,,,,,,,,,,,,,0,1,Maison,74,4,S,sols,,,276,-1.109707,48.811021
2021-863998,2021-12-23,000001,Vente,91800,50,,RUE JEAN HUET,0048,50670,50144,Coulouvray-Boisbenâtre,50,,,50144000AC0032,,,,,,,,,,,,,0,3,Dépendance,,0,S,sols,,,276,-1.109707,48.811021
2021-863998,2021-12-23,000001,Vente,91800,,,LA FORESTERIE,B031,50670,50144,Coulouvray-Boisbenâtre,50,,,50144000AC0290,,,,,,,,,,,,,0,,,,,S,sols,,,200,-1.10953,48.811012
2021-863998,2021-12-23,000001,Vente,91800,,,LA FORESTERIE,B031,50670,50144,Coulouvray-Boisbenâtre,50,,,50144000AC0290,,,,,,,,,,,,,0,,,,,VE,vergers,,,2984,-1.10953,48.811012
