id_mutation,date_mutation,numero_disposition,nature_mutation,valeur_fonciere,adresse_numero,adresse_suffixe,adresse_nom_voie,adresse_code_voie,code_postal,code_commune,nom_commune,code_departement,ancien_code_commune,ancien_nom_commune,id_parcelle,ancien_id_parcelle,numero_volume,lot1_numero,lot1_surface_carrez,lot2_numero,lot2_surface_carrez,lot3_numero,lot3_surface_carrez,lot4_numero,lot4_surface_carrez,lot5_numero,lot5_surface_carrez,nombre_lots,code_type_local,type_local,surface_reelle_bati,nombre_pieces_principales,code_nature_culture,nature_culture,code_nature_culture_speciale,nature_culture_speciale,surface_terrain,longitude,latitude
2021-851111,2021-01-12,000001,Vente,186000,,,LES MOULINERIES AU NORD,B386,50690,50149,Couville,50,,,50149000AB0265,,,,,,,,,,,,,0,,,,,S,sols,,,2955,-1.686383,49.555565
2021-851111,2021-01-12,000001,Vente,186000,21,,RUE DU CAILLOU POINTU,0040,50690,50149,Couville,50,,,50149000AB0268,,,,,,,,,,,,,0,,,,,AB,terrains a bâtir,,,795,-1.68589,49.555227
2021-851111,2021-01-12,000001,Vente,186000,,,VILLAGE DE L EGLISE,B558,50690,50149,Couville,50,,,50149000AB0273,,,,,,,,,,,,,0,,,,,S,sols,,,56,-1.68643,49.553452
2021-851111,2021-01-12,000001,Vente,186000,,,LA MOULINERIE,B385,50690,50149,Couville,50,,,50149000AB0277,,,,,,,,,,,,,0,,,,,S,sols,,,46,-1.686879,49.556094
2021-851111,2021-01-12,000001,Vente,186000,,,VILLAGE DE L EGLISE,B558,50690,50149,Couville,50,,,50149000AB0282,,,,,,,,,,,,,0,,,,,S,sols,,,1646,-1.686557,49.553787
2021-851111,2021-01-12,000001,Vente,186000,,,CLOS DE DERRIERE,B091,50690,50149,Couville,50,,,50149000AB0300,,,,,,,,,,,,,0,,,,,S,sols,,,1854,-1.686527,49.554349
2021-851111,2021-01-12,000001,Vente,186000,,,LA MOULINERIE,B385,50690,50149,Couville,50,,,50149000AB0315,,,,,,,,,,,,,0,,,,,AB,terrains a bâtir,,,4,-1.685757,49.555111
2021-851111,2021-01-12,000001,Vente,186000,,,LA MOULINERIE,B385,50690,50149,Couville,50,,,50149000AB0321,,,,,,,,,,,,,0,,,,,S,sols,,,1940,-1.685559,49.554805
2021-851500,2021-03-11,000001,Vente,138500,3,,ROUTE DU PRESBYTERE,B569,50690,50149,Couville,50,,,50149000AB0127,,,,,,,,,,,,,0,1,Maison,80,4,S,sols,,,500,-1.684163,49.553147
2021-851500,2021-03-11,000001,Vente,138500,3,,ROUTE DU PRESBYTERE,B569,50690,50149,Couville,50,,,50149000AB0127,,,,,,,,,,,,,0,1,Maison,80,4,AG,terrains d'agrément,,,688,-1.684163,49.553147
2021-851532,2021-03-25,000001,Vente,49300,,,LES MOULINERIES AU NORD,B386,50690,50149,Couville,50,,,50149000AB0251,,,,,,,,,,,,,0,,,,,AB,terrains a bâtir,,,152,-1.686365,49.556025
2021-851532,2021-03-25,000001,Vente,49300,,,LES MOULINERIES AU NORD,B386,50690,50149,Couville,50,,,50149000AB0265,,,,,,,,,,,,,0,,,,,S,sols,,,2955,-1.686383,49.555565
2021-851532,2021-03-25,000001,Vente,49300,,,VILLAGE DE L EGLISE,B558,50690,50149,Couville,50,,,50149000AB0273,,,,,,,,,,,,,0,,,,,S,sols,,,56,-1.68643,49.553452
2021-851532,2021-03-25,000001,Vente,49300,20,,RUE DU CAILLOU POINTU,0040,50690,50149,Couville,50,,,50149000AB0275,,,,,,,,,,,,,0,,,,,AB,terrains a bâtir,,,508,-1.686491,49.556179
2021-851532,2021-03-25,000001,Vente,49300,,,LA MOULINERIE,B385,50690,50149,Couville,50,,,50149000AB0277,,,,,,,,,,,,,0,,,,,S,sols,,,46,-1.686879,49.556094
2021-851532,2021-03-25,000001,Vente,49300,,,VILLAGE DE L EGLISE,B558,50690,50149,Couville,50,,,50149000AB0282,,,,,,,,,,,,,0,,,,,S,sols,,,1646,-1.686557,49.553787
2021-851532,2021-03-25,000001,Vente,49300,,,CLOS DE DERRIERE,B091,50690,50149,Couville,50,,,50149000AB0300,,,,,,,,,,,,,0,,,,,S,sols,,,1854,-1.686527,49.554349
2021-851532,2021-03-25,000001,Vente,49300,,,LA MOULINERIE,B385,50690,50149,Couville,50,,,50149000AB0321,,,,,,,,,,,,,0,,,,,S,sols,,,1940,-1.685559,49.554805
2021-851606,2021-03-31,000001,Vente,243000,1,,VILLAGE LES GRANDS,B309,50690,50149,Couville,50,,,50149000ZH0175,,,,,,,,,,,,,0,1,Maison,115,5,AG,terrains d'agrément,,,997,-1.698768,49.553407
2021-851606,2021-03-31,000001,Vente,243000,1,,VILLAGE LES GRANDS,B309,50690,50149,Couville,50,,,50149000ZH0175,,,,,,,,,,,,,0,1,Maison,115,5,S,sols,,,500,-1.698768,49.553407
2021-851606,2021-03-31,000001,Vente,243000,,,LA BRULERIE,B030,50690,50149,Couville,50,,,50149000ZH0177,,,,,,,,,,,,,0,,,,,S,sols,,,125,-1.698827,49.553532
2021-851613,2021-03-25,000001,Vente,110000,,,VILLAGE LES GRANDS,B309,50690,50149,Couville,50,,,50149000ZH0024,,,,,,,,,,,,,0,,,,,P,prés,,,753,-1.697476,49.552338
2021-851613,2021-03-25,000001,Vente,110000,26,,VILLAGE LES GRANDS,B309,50690,50149,Couville,50,,,50149000ZH0157,,,,,,,,,,,,,0,3,Dépendance,,0,S,sols,,,917,-1.697761,49.552198
2021-851613,2021-03-25,000001,Vente,110000,26,,VILLAGE LES GRANDS,B309,50690,50149,Couville,50,,,50149000ZH0157,,,,,,,,,,,,,0,3,Dépendance,,0,S,sols,,,917,-1.697761,49.552198
2021-851613,2021-03-25,000001,Vente,110000,26,,VILLAGE LES GRANDS,B309,50690,50149,Couville,50,,,50149000ZH0157,,,,,,,,,,,,,0,1,Maison,73,4,S,sols,,,917,-1.697761,49.552198
2021-851613,2021-03-25,000001,Vente,110000,,,VILLAGE LES GRANDS,B309,50690,50149,Couville,50,,,50149000ZH0158,,,,,,,,,,,,,0,,,,,S,sols,,,44,-1.697642,49.551987
2021-851671,2021-03-29,000001,Vente,188500,1,,LE BOURG NEUF,B020,50690,50149,Couville,50,,,50149000AD0134,,,,,,,,,,,,,0,1,Maison,156,6,S,sols,,,500,-1.668838,49.557187
2021-851671,2021-03-29,000001,Vente,188500,1,,LE BOURG NEUF,B020,50690,50149,Couville,50,,,50149000AD0134,,,,,,,,,,,,,0,1,Maison,156,6,AG,terrains d'agrément,,,900,-1.668838,49.557187
2021-851805,2021-05-04,000001,Vente,132500,1,,CHEMIN DE LA GARE,B568,50690,50149,Couville,50,,,50149000AD0203,,,,,,,,,,,,,0,1,Maison,32,1,S,sols,,,687,-1.671397,49.557593
2021-851819,2021-04-21,000001,Vente,15000,,,LE BOURG NEUF,B020,50690,50149,Couville,50,,,50149000AD0083,,,,,,,,,,,,,0,,,,,J,jardins,,,319,-1.665754,49.559244
2021-851917,2021-05-18,000001,Vente,49200,,,LES MOULINERIES AU NORD,B386,50690,50149,Couville,50,,,50149000AB0265,,,,,,,,,,,,,0,,,,,S,sols,,,2955,-1.686383,49.555565
2021-851917,2021-05-18,000001,Vente,49200,,,VILLAGE DE L EGLISE,B558,50690,50149,Couville,50,,,50149000AB0273,,,,,,,,,,,,,0,,,,,S,sols,,,56,-1.68643,49.553452
2021-851917,2021-05-18,000001,Vente,49200,,,LA MOULINERIE,B385,50690,50149,Couville,50,,,50149000AB0277,,,,,,,,,,,,,0,,,,,S,sols,,,46,-1.686879,49.556094
2021-851917,2021-05-18,000001,Vente,49200,,,VILLAGE DE L EGLISE,B558,50690,50149,Couville,50,,,50149000AB0282,,,,,,,,,,,,,0,,,,,S,sols,,,1646,-1.686557,49.553787
2021-851917,2021-05-18,000001,Vente,49200,,,CLOS DE DERRIERE,B091,50690,50149,Couville,50,,,50149000AB0300,,,,,,,,,,,,,0,,,,,S,sols,,,1854,-1.686527,49.554349
2021-851917,2021-05-18,000001,Vente,49200,,,LA MOULINERIE,B385,50690,50149,Couville,50,,,50149000AB0321,,,,,,,,,,,,,0,,,,,S,sols,,,1940,-1.685559,49.554805
2021-851917,2021-05-18,000001,Vente,49200,33,,RUE DU CAILLOU POINTU,0040,50690,50149,Couville,50,,,50149000AB0322,,,,,,,,,,,,,0,,,,,AB,terrains a bâtir,,,586,-1.685276,49.554363
2021-852020,2021-05-07,000001,Vente,244200,29,C,RTE DE BRIX,0010,50690,50149,Couville,50,,,50149000AD0023,,,,,,,,,,,,,0,1,Maison,133,6,AG,terrains d'agrément,,,747,-1.669175,49.559217
2021-852020,2021-05-07,000001,Vente,244200,29,C,RTE DE BRIX,0010,50690,50149,Couville,50,,,50149000AD0023,,,,,,,,,,,,,0,1,Maison,133,6,S,sols,,,500,-1.669175,49.559217
2021-854393,2021-06-22,000001,Vente,185000,50,,RTE DE BRIX,0010,50690,50149,Couville,50,,,50149000AD0080,,,,,,,,,,,,,0,1,Maison,64,2,S,sols,,,836,-1.664627,49.559247
2021-854564,2021-06-25,000001,Vente,48800,,,LES MOULINERIES AU NORD,B386,50690,50149,Couville,50,,,50149000AB0265,,,,,,,,,,,,,0,,,,,S,sols,,,2955,-1.686383,49.555565
2021-854564,2021-06-25,000001,Vente,48800,,,VILLAGE DE L EGLISE,B558,50690,50149,Couville,50,,,50149000AB0273,,,,,,,,,,,,,0,,,,,S,sols,,,56,-1.68643,49.553452
2021-854564,2021-06-25,000001,Vente,48800,,,LA MOULINERIE,B385,50690,50149,Couville,50,,,50149000AB0277,,,,,,,,,,,,,0,,,,,S,sols,,,46,-1.686879,49.556094
2021-854564,2021-06-25,000001,Vente,48800,,,VILLAGE DE L EGLISE,B558,50690,50149,Couville,50,,,50149000AB0282,,,,,,,,,,,,,0,,,,,S,sols,,,1646,-1.686557,49.553787
2021-854564,2021-06-25,000001,Vente,48800,,,CLOS DE DERRIERE,B091,50690,50149,Couville,50,,,50149000AB0300,,,,,,,,,,,,,0,,,,,S,sols,,,1854,-1.686527,49.554349
2021-854564,2021-06-25,000001,Vente,48800,,,LA MOULINERIE,B385,50690,50149,Couville,50,,,50149000AB0321,,,,,,,,,,,,,0,,,,,S,sols,,,1940,-1.685559,49.554805
2021-854564,2021-06-25,000001,Vente,48800,35,,RUE DU CAILLOU POINTU,0040,50690,50149,Couville,50,,,50149000AB0323,,,,,,,,,,,,,0,,,,,AB,terrains a bâtir,,,574,-1.685633,49.554307
2021-855235,2021-07-02,000001,Vente,49000,,,LES MOULINERIES AU NORD,B386,50690,50149,Couville,50,,,50149000AB0265,,,,,,,,,,,,,0,,,,,S,sols,,,2955,-1.686383,49.555565
2021-855235,2021-07-02,000001,Vente,49000,,,VILLAGE DE L EGLISE,B558,50690,50149,Couville,50,,,50149000AB0273,,,,,,,,,,,,,0,,,,,S,sols,,,56,-1.68643,49.553452
2021-855235,2021-07-02,000001,Vente,49000,,,LA MOULINERIE,B385,50690,50149,Couville,50,,,50149000AB0277,,,,,,,,,,,,,0,,,,,S,sols,,,46,-1.686879,49.556094
2021-855235,2021-07-02,000001,Vente,49000,,,VILLAGE DE L EGLISE,B558,50690,50149,Couville,50,,,50149000AB0282,,,,,,,,,,,,,0,,,,,S,sols,,,1646,-1.686557,49.553787
2021-855235,2021-07-02,000001,Vente,49000,,,CLOS DE DERRIERE,B091,50690,50149,Couville,50,,,50149000AB0292,,,,,,,,,,,,,0,,,,,AB,terrains a bâtir,,,115,-1.68605,49.554585
2021-855235,2021-07-02,000001,Vente,49000,,,CLOS DE DERRIERE,B091,50690,50149,Couville,50,,,50149000AB0300,,,,,,,,,,,,,0,,,,,S,sols,,,1854,-1.686527,49.554349
2021-855235,2021-07-02,000001,Vente,49000,,,LA MOULINERIE,B385,50690,50149,Couville,50,,,50149000AB0321,,,,,,,,,,,,,0,,,,,S,sols,,,1940,-1.685559,49.554805
2021-855235,2021-07-02,000001,Vente,49000,46,,RUE DU CAILLOU POINTU,0040,50690,50149,Couville,50,,,50149000AB0324,,,,,,,,,,,,,0,,,,,AB,terrains a bâtir,,,491,-1.685801,49.554634
2021-855432,2021-07-06,000001,Vente,49000,,,LES MOULINERIES AU NORD,B386,50690,50149,Couville,50,,,50149000AB0253,,,,,,,,,,,,,0,,,,,AB,terrains a bâtir,,,142,-1.686927,49.555937
2021-855432,2021-07-06,000001,Vente,49000,,,LES MOULINERIES AU NORD,B386,50690,50149,Couville,50,,,50149000AB0265,,,,,,,,,,,,,0,,,,,S,sols,,,2955,-1.686383,49.555565
2021-855432,2021-07-06,000001,Vente,49000,,,VILLAGE DE L EGLISE,B558,50690,50149,Couville,50,,,50149000AB0273,,,,,,,,,,,,,0,,,,,S,sols,,,56,-1.68643,49.553452
2021-855432,2021-07-06,000001,Vente,49000,,,LA MOULINERIE,B385,50690,50149,Couville,50,,,50149000AB0277,,,,,,,,,,,,,0,,,,,S,sols,,,46,-1.686879,49.556094
2021-855432,2021-07-06,000001,Vente,49000,24,,RUE DU CAILLOU POINTU,0040,50690,50149,Couville,50,,,50149000AB0278,,,,,,,,,,,,,0,,,,,AB,terrains a bâtir,,,460,-1.687019,49.556065
2021-855432,2021-07-06,000001,Vente,49000,,,VILLAGE DE L EGLISE,B558,50690,50149,Couville,50,,,50149000AB0282,,,,,,,,,,,,,0,,,,,S,sols,,,1646,-1.686557,49.553787
2021-855432,2021-07-06,000001,Vente,49000,,,CLOS DE DERRIERE,B091,50690,50149,Couville,50,,,50149000AB0300,,,,,,,,,,,,,0,,,,,S,sols,,,1854,-1.686527,49.554349
2021-855432,2021-07-06,000001,Vente,49000,,,LA MOULINERIE,B385,50690,50149,Couville,50,,,50149000AB0321,,,,,,,,,,,,,0,,,,,S,sols,,,1940,-1.685559,49.554805
2021-857133,2021-08-17,000001,Vente,262250,16,,RUE DU CAILLOU POINTU,0040,50690,50149,Couville,50,,,50149000AB0201,,,,,,,,,,,,,0,1,Maison,96,5,S,sols,,,667,-1.685856,49.556251
2021-857255,2021-07-30,000001,Vente,205000,,,RES LA MOULINERIE,0055,50690,50149,Couville,50,,,50149000AB0041,,,,,,,,,,,,,0,,,,,S,sols,,,13,-1.690415,49.553647
2021-857255,2021-07-30,000001,Vente,205000,4,,RES LA MOULINERIE,0055,50690,50149,Couville,50,,,50149000AB0056,,,,,,,,,,,,,0,1,Maison,84,4,S,sols,,,655,-1.689577,49.554171
2021-857255,2021-07-30,000001,Vente,205000,,,RES LA MOULINERIE,0055,50690,50149,Couville,50,,,50149000AB0058,,,,,,,,,,,,,0,,,,,AG,terrains d'agrément,,,2027,-1.689711,49.553863
2021-857475,2021-08-09,000001,Vente,115000,19,,LE BOURG NEUF,B020,50690,50149,Couville,50,,,50149000AD0050,,,,,,,,,,,,,0,3,Dépendance,,0,S,sols,,,379,-1.667194,49.560194
2021-857475,2021-08-09,000001,Vente,115000,19,,LE BOURG NEUF,B020,50690,50149,Couville,50,,,50149000AD0050,,,,,,,,,,,,,0,1,Maison,92,4,S,sols,,,379,-1.667194,49.560194
2021-857475,2021-08-09,000001,Vente,115000,19,,LE BOURG NEUF,B020,50690,50149,Couville,50,,,50149000AD0050,,,,,,,,,,,,,0,3,Dépendance,,0,S,sols,,,379,-1.667194,49.560194
2021-857475,2021-08-09,000001,Vente,115000,,,LE BOURG NEUF,B020,50690,50149,Couville,50,,,50149000AD0210,,,,,,,,,,,,,0,,,,,J,jardins,,,159,-1.667253,49.560311
2021-858552,2021-09-14,000001,Vente,49400,,,LES MOULINERIES AU NORD,B386,50690,50149,Couville,50,,,50149000AB0250,,,,,,,,,,,,,0,,,,,AB,terrains a bâtir,,,142,-1.686093,49.556074
2021-858552,2021-09-14,000001,Vente,49400,,,LES MOULINERIES AU NORD,B386,50690,50149,Couville,50,,,50149000AB0265,,,,,,,,,,,,,0,,,,,S,sols,,,2955,-1.686383,49.555565
2021-858552,2021-09-14,000001,Vente,49400,,,VILLAGE DE L EGLISE,B558,50690,50149,Couville,50,,,50149000AB0273,,,,,,,,,,,,,0,,,,,S,sols,,,56,-1.68643,49.553452
2021-858552,2021-09-14,000001,Vente,49400,18,,RUE DU CAILLOU POINTU,0040,50690,50149,Couville,50,,,50149000AB0274,,,,,,,,,,,,,0,,,,,AB,terrains a bâtir,,,535,-1.686206,49.556227
2021-858552,2021-09-14,000001,Vente,49400,,,LA MOULINERIE,B385,50690,50149,Couville,50,,,50149000AB0277,,,,,,,,,,,,,0,,,,,S,sols,,,46,-1.686879,49.556094
2021-858552,2021-09-14,000001,Vente,49400,,,VILLAGE DE L EGLISE,B558,50690,50149,Couville,50,,,50149000AB0282,,,,,,,,,,,,,0,,,,,S,sols,,,1646,-1.686557,49.553787
2021-858552,2021-09-14,000001,Vente,49400,,,CLOS DE DERRIERE,B091,50690,50149,Couville,50,,,50149000AB0300,,,,,,,,,,,,,0,,,,,S,sols,,,1854,-1.686527,49.554349
2021-858552,2021-09-14,000001,Vente,49400,,,LA MOULINERIE,B385,50690,50149,Couville,50,,,50149000AB0321,,,,,,,,,,,,,0,,,,,S,sols,,,1940,-1.685559,49.554805
2021-858770,2021-09-21,000001,Vente,204000,12,,VILLAGE LA COUR,B566,50690,50149,Couville,50,,,50149000AC0038,,,,,,,,,,,,,0,3,Dépendance,,0,S,sols,,,500,-1.676055,49.557364
2021-858770,2021-09-21,000001,Vente,204000,12,,VILLAGE LA COUR,B566,50690,50149,Couville,50,,,50149000AC0038,,,,,,,,,,,,,0,3,Dépendance,,0,S,sols,,,500,-1.676055,49.557364
2021-858770,2021-09-21,000001,Vente,204000,12,,VILLAGE LA COUR,B566,50690,50149,Couville,50,,,50149000AC0038,,,,,,,,,,,,,0,1,Maison,164,7,AG,terrains d'agrément,,,836,-1.676055,49.557364
2021-858770,2021-09-21,000001,Vente,204000,12,,VILLAGE LA COUR,B566,50690,50149,Couville,50,,,50149000AC0038,,,,,,,,,,,,,0,3,Dépendance,,0,AG,terrains d'agrément,,,836,-1.676055,49.557364
2021-858770,2021-09-21,000001,Vente,204000,12,,VILLAGE LA COUR,B566,50690,50149,Couville,50,,,50149000AC0038,,,,,,,,,,,,,0,3,Dépendance,,0,AG,terrains d'agrément,,,836,-1.676055,49.557364
2021-858770,2021-09-21,000001,Vente,204000,12,,VILLAGE LA COUR,B566,50690,50149,Couville,50,,,50149000AC0038,,,,,,,,,,,,,0,3,Dépendance,,0,AG,terrains d'agrément,,,836,-1.676055,49.557364
2021-858770,2021-09-21,000001,Vente,204000,12,,VILLAGE LA COUR,B566,50690,50149,Couville,50,,,50149000AC0038,,,,,,,,,,,,,0,1,Maison,164,7,S,sols,,,500,-1.676055,49.557364
2021-858770,2021-09-21,000001,Vente,204000,12,,VILLAGE LA COUR,B566,50690,50149,Couville,50,,,50149000AC0038,,,,,,,,,,,,,0,3,Dépendance,,0,S,sols,,,500,-1.676055,49.557364
2021-858801,2021-09-16,000001,Vente,110320,18,,VILLAGE DE LA GARE,B559,50690,50149,Couville,50,,,50149000AD0160,,,,,,,,,,,,,0,1,Maison,98,4,S,sols,,,192,-1.67039,49.555622
2021-859430,2021-09-27,000001,Vente,250000,15,,VILLAGE LA VALLEE,B550,50690,50149,Couville,50,,,50149000AC0024,,,,,,,,,,,,,0,1,Maison,130,5,S,sols,,,467,-1.680339,49.554933
2021-859430,2021-09-27,000001,Vente,250000,15,,VILLAGE LA VALLEE,B550,50690,50149,Couville,50,,,50149000AC0024,,,,,,,,,,,,,0,3,Dépendance,,0,S,sols,,,467,-1.680339,49.554933
2021-859980,2021-10-13,000001,Vente,300000,14,,ROUTE DE VIRANDEVILLE,B570,50690,50149,Couville,50,,,50149000AB0038,,,,,,,,,,,,,0,1,Maison,171,6,J,jardins,,,1022,-1.691113,49.554005
2021-859980,2021-10-13,000001,Vente,300000,14,,ROUTE DE VIRANDEVILLE,B570,50690,50149,Couville,50,,,50149000AB0038,,,,,,,,,,,,,0,1,Maison,171,6,S,sols,,,500,-1.691113,49.554005
2021-860136,2021-10-05,000001,Vente,55000,,,LE DROIT CHEMIN,B218,50690,50149,Couville,50,,,50149000AE0105,,,,,,,,,,,,,0,,,,,S,sols,,,102,-1.670036,49.551945
2021-860136,2021-10-05,000001,Vente,55000,27,,RUE DES HAIES,0053,50690,50149,Couville,50,,,50149000AE0121,,,,,,,,,,,,,0,,,,,AB,terrains a bâtir,,,776,-1.669205,49.551958
2021-860136,2021-10-05,000001,Vente,55000,,,LE DROIT CHEMIN,B218,50690,50149,Couville,50,,,50149000AE0131,,,,,,,,,,,,,0,,,,,S,sols,,,1807,-1.669227,49.552002
2021-860138,2021-10-05,000001,Vente,53000,,,LE DROIT CHEMIN,B218,50690,50149,Couville,50,,,50149000AE0105,,,,,,,,,,,,,0,,,,,S,sols,,,102,-1.670036,49.551945
2021-860138,2021-10-05,000001,Vente,53000,13,,RUE DES HAIES,0053,50690,50149,Couville,50,,,50149000AE0128,,,,,,,,,,,,,0,,,,,AB,terrains a bâtir,,,652,-1.668795,49.552017
2021-860138,2021-10-05,000001,Vente,53000,,,LE DROIT CHEMIN,B218,50690,50149,Couville,50,,,50149000AE0131,,,,,,,,,,,,,0,,,,,S,sols,,,1807,-1.669227,49.552002
2021-860386,2021-10-20,000001,Vente,49200,,,LES MOULINERIES AU NORD,B386,50690,50149,Couville,50,,,50149000AB0265,,,,,,,,,,,,,0,,,,,S,sols,,,2955,-1.686383,49.555565
2021-860386,2021-10-20,000001,Vente,49200,,,VILLAGE DE L EGLISE,B558,50690,50149,Couville,50,,,50149000AB0273,,,,,,,,,,,,,0,,,,,S,sols,,,56,-1.68643,49.553452
2021-860386,2021-10-20,000001,Vente,49200,,,LA MOULINERIE,B385,50690,50149,Couville,50,,,50149000AB0277,,,,,,,,,,,,,0,,,,,S,sols,,,46,-1.686879,49.556094
2021-860386,2021-10-20,000001,Vente,49200,,,VILLAGE DE L EGLISE,B558,50690,50149,Couville,50,,,50149000AB0282,,,,,,,,,,,,,0,,,,,S,sols,,,1646,-1.686557,49.553787
2021-860386,2021-10-20,000001,Vente,49200,,,CLOS DE DERRIERE,B091,50690,50149,Couville,50,,,50149000AB0300,,,,,,,,,,,,,0,,,,,S,sols,,,1854,-1.686527,49.554349
2021-860386,2021-10-20,000001,Vente,49200,31,,RUE DU CAILLOU POINTU,0040,50690,50149,Couville,50,,,50149000AB0320,,,,,,,,,,,,,0,,,,,AB,terrains a bâtir,,,574,-1.685372,49.554606
2021-860386,2021-10-20,000001,Vente,49200,,,LA MOULINERIE,B385,50690,50149,Couville,50,,,50149000AB0321,,,,,,,,,,,,,0,,,,,S,sols,,,1940,-1.685559,49.554805
2021-860388,2021-10-20,000001,Vente,49000,,,LES MOULINERIES AU NORD,B386,50690,50149,Couville,50,,,50149000AB0265,,,,,,,,,,,,,0,,,,,S,sols,,,2955,-1.686383,49.555565
2021-860388,2021-10-20,000001,Vente,49000,,,VILLAGE DE L EGLISE,B558,50690,50149,Couville,50,,,50149000AB0273,,,,,,,,,,,,,0,,,,,S,sols,,,56,-1.68643,49.553452
2021-860388,2021-10-20,000001,Vente,49000,,,LA MOULINERIE,B385,50690,50149,Couville,50,,,50149000AB0277,,,,,,,,,,,,,0,,,,,S,sols,,,46,-1.686879,49.556094
2021-860388,2021-10-20,000001,Vente,49000,,,VILLAGE DE L EGLISE,B558,50690,50149,Couville,50,,,50149000AB0282,,,,,,,,,,,,,0,,,,,S,sols,,,1646,-1.686557,49.553787
2021-860388,2021-10-20,000001,Vente,49000,,,CLOS DE DERRIERE,B091,50690,50149,Couville,50,,,50149000AB0300,,,,,,,,,,,,,0,,,,,S,sols,,,1854,-1.686527,49.554349
2021-860388,2021-10-20,000001,Vente,49000,29,,RUE DU CAILLOU POINTU,0040,50690,50149,Couville,50,,,50149000AB0319,,,,,,,,,,,,,0,,,,,AB,terrains a bâtir,,,602,-1.685188,49.554759
2021-860388,2021-10-20,000001,Vente,49000,,,LA MOULINERIE,B385,50690,50149,Couville,50,,,50149000AB0321,,,,,,,,,,,,,0,,,,,S,sols,,,1940,-1.685559,49.554805
2021-860395,2021-10-21,000001,Vente,51000,,,LE DROIT CHEMIN,B218,50690,50149,Couville,50,,,50149000AE0105,,,,,,,,,,,,,0,,,,,S,sols,,,102,-1.670036,49.551945
2021-860395,2021-10-21,000001,Vente,51000,17,,RUE DES HAIES,0053,50690,50149,Couville,50,,,50149000AE0126,,,,,,,,,,,,,0,,,,,AB,terrains a bâtir,,,408,-1.669223,49.552281
2021-860395,2021-10-21,000001,Vente,51000,,,LE DROIT CHEMIN,B218,50690,50149,Couville,50,,,50149000AE0131,,,,,,,,,,,,,0,,,,,S,sols,,,1807,-1.669227,49.552002
2021-860395,2021-10-21,000001,Vente,51000,,,VILLAGE DE LA GARE,B559,50690,50149,Couville,50,,,50149000ZD0139,,,,,,,,,,,,,0,,,,,AB,terrains a bâtir,,,189,-1.668997,49.552354
2021-860397,2021-10-20,000001,Vente,50700,,,LE DROIT CHEMIN,B218,50690,50149,Couville,50,,,50149000AE0105,,,,,,,,,,,,,0,,,,,S,sols,,,102,-1.670036,49.551945
2021-860397,2021-10-20,000001,Vente,50700,9,,RUE DES HAIES,0053,50690,50149,Couville,50,,,50149000AE0130,,,,,,,,,,,,,0,,,,,AB,terrains a bâtir,,,516,-1.668982,49.551681
2021-860397,2021-10-20,000001,Vente,50700,,,LE DROIT CHEMIN,B218,50690,50149,Couville,50,,,50149000AE0131,,,,,,,,,,,,,0,,,,,S,sols,,,1807,-1.669227,49.552002
2021-860519,2021-10-15,000001,Vente,88905.67,,,VILLAGE LA NEUVILLERIE,B388,50690,50149,Couville,50,,,50149000ZC0005,,,,,,,,,,,,,0,,,,,P,prés,,,35376,-1.668458,49.565395
2021-860519,2021-10-15,000001,Vente,88905.67,,,VILLAGE LA DORANGERIE,B217,50690,50149,Couville,50,,,50149000ZC0064,,,,,,,,,,,,,0,,,,,P,prés,,,4655,-1.673361,49.562152
2021-860519,2021-10-15,000001,Vente,88905.67,,,VILLAGE LA DORANGERIE,B217,50690,50149,Couville,50,,,50149000ZC0064,,,,,,,,,,,,,0,,,,,P,prés,,,11740,-1.673361,49.562152
2021-860519,2021-10-15,000001,Vente,88905.67,,,VILLAGE LA NEUVILLERIE,B388,50690,50149,Couville,50,,,50149000ZC0077,,,,,,,,,,,,,0,,,,,P,prés,,,6398,-1.679899,49.562125
2021-860519,2021-10-15,000001,Vente,88905.67,,,VILLAGE LA NEUVILLERIE,B388,50690,50149,Couville,50,,,50149000ZC0100,,,,,,,,,,,,,0,,,,,P,prés,,,30823,-1.669309,49.56401
2021-860519,2021-10-15,000001,Vente,88905.67,,,VILLAGE LA DORANGERIE,B217,50690,50149,Couville,50,,,50149000ZC0103,,,,,,,,,,,,,0,,,,,P,prés,,,4367,-1.673763,49.561453
2021-860519,2021-10-15,000001,Vente,88905.67,,,VILLAGE LA DORANGERIE,B217,50690,50149,Couville,50,,,50149000ZC0103,,,,,,,,,,,,,0,,,,,P,prés,,,4500,-1.673763,49.561453
2021-860519,2021-10-15,000001,Vente,88905.67,,,VILLAGE LA DORANGERIE,B217,50690,50149,Couville,50,,,50149000ZC0103,,,,,,,,,,,,,0,,,,,P,prés,,,6600,-1.673763,49.561453
2021-860519,2021-10-15,000001,Vente,88905.67,,,LA CROIX VALTOT,B212,50690,50149,Couville,50,,,50149000ZE0005,,,,,,,,,,,,,0,,,,,P,prés,,,6202,-1.678984,49.561447
2021-860646,2021-10-28,000001,Vente,228000,,,VILLAGE LA LANDELLE,B348,50690,50149,Couville,50,,,50149000ZD0017,,,,,,,,,,,,,0,,,,,S,sols,,,412,-1.661891,49.551775
2021-860646,2021-10-28,000001,Vente,228000,13,,VILLAGE LA LANDELLE,B348,50690,50149,Couville,50,,,50149000ZD0018,,,,,,,,,,,,,0,3,Dépendance,,0,J,jardins,,,1120,-1.66195,49.552017
2021-860646,2021-10-28,000001,Vente,228000,13,,VILLAGE LA LANDELLE,B348,50690,50149,Couville,50,,,50149000ZD0018,,,,,,,,,,,,,0,1,Maison,84,3,J,jardins,,,1120,-1.66195,49.552017
2021-860646,2021-10-28,000001,Vente,228000,13,,VILLAGE LA LANDELLE,B348,50690,50149,Couville,50,,,50149000ZD0018,,,,,,,,,,,,,0,3,Dépendance,,0,S,sols,,,1476,-1.66195,49.552017
2021-860646,2021-10-28,000001,Vente,228000,13,,VILLAGE LA LANDELLE,B348,50690,50149,Couville,50,,,50149000ZD0018,,,,,,,,,,,,,0,3,Dépendance,,0,S,sols,,,1476,-1.66195,49.552017
2021-860646,2021-10-28,000001,Vente,228000,13,,VILLAGE LA LANDELLE,B348,50690,50149,Couville,50,,,50149000ZD0018,,,,,,,,,,,,,0,1,Maison,84,3,S,sols,,,1476,-1.66195,49.552017
2021-860646,2021-10-28,000001,Vente,228000,13,,VILLAGE LA LANDELLE,B348,50690,50149,Couville,50,,,50149000ZD0018,,,,,,,,,,,,,0,3,Dépendance,,0,J,jardins,,,1120,-1.66195,49.552017
2021-860768,2021-10-22,000001,Vente,18951.75,,,PONT AUX ETIENNES,B468,50690,50149,Couville,50,,,50149000ZC0001,,,,,,,,,,,,,0,,,,,BT,taillis simples,,,36395,-1.669253,49.568842
2021-860768,2021-10-22,000001,Vente,18951.75,,,PONT AUX ETIENNES,B468,50690,50149,Couville,50,,,50149000ZC0001,,,,,,,,,,,,,0,,,,,P,prés,,,5720,-1.669253,49.568842
2021-861241,2021-11-10,000001,Vente,198000,16,,VILLAGE LA COUR,B566,50690,50149,Couville,50,,,50149000AC0106,,,,,,,,,,,,,0,1,Maison,95,4,S,sols,,,279,-1.675222,49.557431
2021-861260,2021-11-03,000001,Vente,240000,82,,ROUTE DE L EGLISE,B567,50690,50149,Couville,50,,,50149000AB0090,,,,,,,,,,,,,0,1,Maison,130,5,S,sols,,,500,-1.689624,49.55219