id_mutation,date_mutation,numero_disposition,nature_mutation,valeur_fonciere,adresse_numero,adresse_suffixe,adresse_nom_voie,adresse_code_voie,code_postal,code_commune,nom_commune,code_departement,ancien_code_commune,ancien_nom_commune,id_parcelle,ancien_id_parcelle,numero_volume,lot1_numero,lot1_surface_carrez,lot2_numero,lot2_surface_carrez,lot3_numero,lot3_surface_carrez,lot4_numero,lot4_surface_carrez,lot5_numero,lot5_surface_carrez,nombre_lots,code_type_local,type_local,surface_reelle_bati,nombre_pieces_principales,code_nature_culture,nature_culture,code_nature_culture_speciale,nature_culture_speciale,surface_terrain,longitude,latitude
2021-853764,2021-05-07,000001,Vente,21000,,,LE CALIPET,B035,50630,50395,La Pernelle,50,,,50395000AB0018,,,,,,,,,,,,,0,,,,,P,prés,,,7010,-1.341464,49.606954
2021-853764,2021-05-07,000001,Vente,21000,,,LES RAGOTS,B499,50630,50395,La Pernelle,50,,,50395000AB0059,,,,,,,,,,,,,0,,,,,P,prés,,,8257,-1.33969,49.606797
2021-853764,2021-05-07,000001,Vente,21000,,,LES RAGOTS,B499,50630,50395,La Pernelle,50,,,50395000AB0065,,,,,,,,,,,,,0,,,,,P,prés,,,9881,-1.3406,49.606386
2021-853764,2021-05-07,000001,Vente,21000,,,LES RAGOTS,B499,50630,50395,La Pernelle,50,,,50395000AB0067,,,,,,,,,,,,,0,,,,,P,prés,,,7365,-1.340133,49.605156
2021-853764,2021-05-07,000001,Vente,21000,,,LES GALLIERES,B264,50630,50395,La Pernelle,50,,,50395000AB0068,,,,,,,,,,,,,0,,,,,P,prés,,,12800,-1.341867,49.605746
2021-857351,2021-08-23,000001,Vente,3000,,,LA BUTTE DE TILLY,B031,50630,50395,La Pernelle,50,,,50395000AE0262,,,,,,,,,,,,,0,,,,,BT,taillis simples,,,7995,-1.297154,49.618876
2021-857351,2021-08-23,000001,Vente,3000,,,LA PIECE DE LA CROIX,B442,50630,50395,La Pernelle,50,,,50395000AE0264,,,,,,,,,,,,,0,,,,,L,landes,,,3855,-1.295901,49.618611
2021-857351,2021-08-23,000001,Vente,3000,,,LA PIECE DE LA CROIX,B442,50630,50395,La Pernelle,50,,,50395000AE0264,,,,,,,,,,,,,0,,,,,BT,taillis simples,,,3854,-1.295901,49.618611
2021-859164,2021-09-28,000001,Vente,370000,1,,HAMEAU DOUCET,B306,50630,50395,La Pernelle,50,,,50395000AE0186,,,,,,,,,,,,,0,1,Maison,121,4,S,sols,,,136,-1.303419,49.613904
2021-859164,2021-09-28,000001,Vente,370000,1,,HAMEAU DOUCET,B306,50630,50395,La Pernelle,50,,,50395000AE0186,,,,,,,,,,,,,0,1,Maison,121,4,AG,terrains d'agrément,,,9471,-1.303419,49.613904
2021-859164,2021-09-28,000001,Vente,370000,,,LE CLOS DE LA LANDE,B125,50630,50395,La Pernelle,50,,,50395000AE0198,,,,,,,,,,,,,0,,,,,BT,taillis simples,,,1816,-1.304418,49.613861
2021-859595,2021-09-23,000001,Vente,450000,,,LE CLOS A VACHES,B075,50630,50395,La Pernelle,50,,,50395000AE0007,,,,,,,,,,,,,0,,,,,J,jardins,,,706,-1.308547,49.613709
2021-859595,2021-09-23,000001,Vente,450000,,,HAMEAU ENAULT,B308,50630,50395,La Pernelle,50,,,50395000AE0008,,,,,,,,,,,,,0,,,,,J,jardins,,,641,-1.308564,49.613463
2021-859595,2021-09-23,000001,Vente,450000,6,,HAMEAU ENAULT,B308,50630,50395,La Pernelle,50,,,50395000AE0009,,,,,,,,,,,,,0,1,Maison,293,6,S,sols,,,450,-1.308332,49.613603
2021-859595,2021-09-23,000001,Vente,450000,6,,HAMEAU ENAULT,B308,50630,50395,La Pernelle,50,,,50395000AE0009,,,,,,,,,,,,,0,3,Dépendance,,0,S,sols,,,450,-1.308332,49.613603
2021-859595,2021-09-23,000001,Vente,450000,6,,HAMEAU ENAULT,B308,50630,50395,La Pernelle,50,,,50395000AE0009,,,,,,,,,,,,,0,3,Dépendance,,0,S,sols,,,450,-1.308332,49.613603
2021-859595,2021-09-23,000001,Vente,450000,4,,HAMEAU ENAULT,B308,50630,50395,La Pernelle,50,,,50395000AE0010,,,,,,,,,,,,,0,1,Maison,45,1,S,sols,,,704,-1.308197,49.61378
2021-859595,2021-09-23,000001,Vente,450000,4,,HAMEAU ENAULT,B308,50630,50395,La Pernelle,50,,,50395000AE0010,,,,,,,,,,,,,0,3,Dépendance,,0,S,sols,,,704,-1.308197,49.61378
2021-859595,2021-09-23,000001,Vente,450000,4,,HAMEAU ENAULT,B308,50630,50395,La Pernelle,50,,,50395000AE0010,,,,,,,,,,,,,0,1,Maison,90,4,S,sols,,,704,-1.308197,49.61378
2021-859595,2021-09-23,000001,Vente,450000,4,,HAMEAU ENAULT,B308,50630,50395,La Pernelle,50,,,50395000AE0010,,,,,,,,,,,,,0,3,Dépendance,,0,S,sols,,,704,-1.308197,49.61378
2021-859595,2021-09-23,000001,Vente,450000,,,HAMEAU ENAULT,B308,50630,50395,La Pernelle,50,,,50395000AE0011,,,,,,,,,,,,,0,,,,,J,jardins,,,204,-1.308002,49.613782
2021-859595,2021-09-23,000001,Vente,450000,,,LE CLOS A VACHES,B075,50630,50395,La Pernelle,50,,,50395000AE0277,,,,,,,,,,,,,0,,,,,P,prés,,,67,-1.308344,49.61389
2021-862498,2021-12-13,000001,Vente,12000,,,LA TERRE A L AUVRAY,B526,50630,50395,La Pernelle,50,,,50395000AC0041,,,,,,,,,,,,,0,,,,,P,prés,,,7432,-1.324556,49.605855
2021-862498,2021-12-13,000001,Vente,12000,,,LE BUISSON,B027,50630,50395,La Pernelle,50,,,50395000AC0046,,,,,,,,,,,,,0,,,,,P,prés,,,6715,-1.324734,49.606434
2021-864344,2021-01-28,000001,Vente,4000,,,LES PLATONS DU TOT,B453,50630,50395,La Pernelle,50,,,50395000AK0055,,,,,,,,,,,,,0,,,,,P,prés,,,2179,-1.274953,49.614355
2021-864344,2021-01-28,000001,Vente,4000,,,LES PLATONS DU TOT,B453,50630,50395,La Pernelle,50,,,50395000AK0055,,,,,,,,,,,,,0,,,,,E,eaux,MARE,Mare,1901,-1.274953,49.614355
2021-864483,2021-03-15,000001,Vente,8000,,,HAMEAU DU TRONQUET,B307,50630,50395,La Pernelle,50,,,50395000AB0198,,,,,,,,,,,,,0,,,,,J,jardins,,,1528,-1.337608,49.599957
2021-864483,2021-03-15,000001,Vente,8000,,,HAMEAU DU TRONQUET,B307,50630,50395,La Pernelle,50,,,50395000AB0199,,,,,,,,,,,,,0,,,,,S,sols,,,802,-1.337697,49.600173
2021-864783,2021-05-07,000001,Vente,250000,,,LE JARDIN DE DERRIERE,B337,50630,50395,La Pernelle,50,,,50395000AB0161,,,,,,,,,,,,,0,,,,,J,jardins,,,1641,-1.331709,49.603434
2021-864783,2021-05-07,000001,Vente,250000,1,,FANOVILLE,B302,50630,50395,La Pernelle,50,,,50395000AB0162,,,,,,,,,,,,,0,1,Maison,187,5,S,sols,,,2355,-1.331631,49.60372
2021-864783,2021-05-07,000001,Vente,250000,,,LE JARDIN BAUDE,B334,50630,50395,La Pernelle,50,,,50395000AB0163,,,,,,,,,,,,,0,,,,,P,prés,,,4120,-1.331296,49.603855
2021-864783,2021-05-07,000001,Vente,250000,,,LE PRE DE FANOVILLE,B464,50630,50395,La Pernelle,50,,,50395000AB0166,,,,,,,,,,,,,0,,,,,L,landes,,,234,-1.330897,49.603411
2021-864783,2021-05-07,000001,Vente,250000,,,LA VOIE,B546,50630,50395,La Pernelle,50,,,50395000AB0167,,,,,,,,,,,,,0,,,,,P,prés,,,761,-1.330395,49.602883
