id_mutation,date_mutation,numero_disposition,nature_mutation,valeur_fonciere,adresse_numero,adresse_suffixe,adresse_nom_voie,adresse_code_voie,code_postal,code_commune,nom_commune,code_departement,ancien_code_commune,ancien_nom_commune,id_parcelle,ancien_id_parcelle,numero_volume,lot1_numero,lot1_surface_carrez,lot2_numero,lot2_surface_carrez,lot3_numero,lot3_surface_carrez,lot4_numero,lot4_surface_carrez,lot5_numero,lot5_surface_carrez,nombre_lots,code_type_local,type_local,surface_reelle_bati,nombre_pieces_principales,code_nature_culture,nature_culture,code_nature_culture_speciale,nature_culture_speciale,surface_terrain,longitude,latitude
2021-850040,2021-02-26,000002,Vente,57000,,,LE GRAND CHAMP,B644,50720,50462,Saint-Cyr-du-Bailleul,50,,,504620000B0490,,,,,,,,,,,,,0,,,,,S,sols,,,25,-0.800445,48.550398
2021-850040,2021-02-26,000002,Vente,57000,5156,,LA RAMARDIERE,B986,50720,50462,Saint-Cyr-du-Bailleul,50,,,504620000B0491,,,,,,,,,,,,,0,1,Maison,91,2,S,sols,,,580,-0.800877,48.550385
2021-850040,2021-02-26,000002,Vente,57000,,,LA RAMARDIERE,B986,50720,50462,Saint-Cyr-du-Bailleul,50,,,504620000B0492,,,,,,,,,,,,,0,,,,,S,sols,,,752,-0.800978,48.55023
2021-850040,2021-02-26,000002,Vente,57000,,,LA RAMARDIERE,B986,50720,50462,Saint-Cyr-du-Bailleul,50,,,504620000B0493,,,,,,,,,,,,,0,,,,,VE,vergers,,,860,,
2021-850040,2021-02-26,000002,Vente,57000,,,LA RAMARDIERE,B986,50720,50462,Saint-Cyr-du-Bailleul,50,,,504620000B0496,,,,,,,,,,,,,0,,,,,VE,vergers,,,2020,-0.801192,48.550486
2021-850040,2021-02-26,000002,Vente,57000,,,LA RAMARDIERE,B986,50720,50462,Saint-Cyr-du-Bailleul,50,,,504620000B0497,,,,,,,,,,,,,0,,,,,J,jardins,,,920,-0.800706,48.550512
2021-850474,2021-04-01,000001,Vente,29000,,,LE PRE DU PONT ACHARD,B887,50720,50462,Saint-Cyr-du-Bailleul,50,,,504620000D0173,,,,,,,,,,,,,0,,,,,P,prés,,,285,-0.859854,48.564388
2021-850474,2021-04-01,000001,Vente,29000,,,LE PRE DE MANGEON,B888,50720,50462,Saint-Cyr-du-Bailleul,50,,,504620000D0175,,,,,,,,,,,,,0,,,,,P,prés,,,5610,-0.859363,48.565147
2021-850475,2021-04-01,000001,Vente,23500,,,LE PRE DU PONT ACHARD,B887,50720,50462,Saint-Cyr-du-Bailleul,50,,,504620000D0173,,,,,,,,,,,,,0,,,,,P,prés,,,285,-0.859854,48.564388
2021-850475,2021-04-01,000001,Vente,23500,,,LE PRE DE MANGEON,B888,50720,50462,Saint-Cyr-du-Bailleul,50,,,504620000D0175,,,,,,,,,,,,,0,,,,,P,prés,,,5610,-0.859363,48.565147
2021-850480,2021-04-01,000002,Echange,91240,,,LA NOE,B229,50720,50462,Saint-Cyr-du-Bailleul,50,,,504620000D0172,,,,,,,,,,,,,0,,,,,P,prés,,,1560,-0.858197,48.565066
2021-850521,2021-04-07,000001,Vente,49700,,,LA LOUVETIERE,B210,50720,50462,Saint-Cyr-du-Bailleul,50,,,504620000C0173,,,,,,,,,,,,,0,,,,,J,jardins,,,1300,-0.845711,48.559686
2021-850521,2021-04-07,000001,Vente,49700,5261,,LA LOUVETIERE,B210,50720,50462,Saint-Cyr-du-Bailleul,50,,,504620000C0769,,,,,,,,,,,,,0,3,Dépendance,,0,S,sols,,,395,-0.845456,48.560396
2021-850521,2021-04-07,000001,Vente,49700,5261,,LA LOUVETIERE,B210,50720,50462,Saint-Cyr-du-Bailleul,50,,,504620000C0769,,,,,,,,,,,,,0,3,Dépendance,,0,S,sols,,,395,-0.845456,48.560396
2021-850521,2021-04-07,000001,Vente,49700,5261,,LA LOUVETIERE,B210,50720,50462,Saint-Cyr-du-Bailleul,50,,,504620000C0769,,,,,,,,,,,,,0,1,Maison,98,3,S,sols,,,395,-0.845456,48.560396
2021-850521,2021-04-07,000001,Vente,49700,,,LA LOUVETIERE,B210,50720,50462,Saint-Cyr-du-Bailleul,50,,,504620000C1563,,,,,,,,,,,,,0,,,,,S,sols,,,1300,-0.845402,48.559967
2021-850533,2021-04-07,000001,Vente,5728,,,LE CHAMP DE LA CHAPELLE,B423,50720,50462,Saint-Cyr-du-Bailleul,50,,,504620000C1654,,,,,,,,,,,,,0,,,,,P,prés,,,4774,-0.848747,48.57385
2021-850699,2021-04-23,000001,Vente,38845,,,LE CLOS COLAS,B554,50720,50462,Saint-Cyr-du-Bailleul,50,,,504620000B0874,,,,,,,,,,,,,0,,,,,P,prés,,,450,-0.821356,48.559841
2021-850699,2021-04-23,000001,Vente,38845,,,LE CLOS COLAS,B554,50720,50462,Saint-Cyr-du-Bailleul,50,,,504620000B0875,,,,,,,,,,,,,0,,,,,P,prés,,,6800,-0.821839,48.559857
2021-850699,2021-04-23,000001,Vente,38845,,,LA GUILLARDIERE,B171,50720,50462,Saint-Cyr-du-Bailleul,50,,,504620000B0877,,,,,,,,,,,,,0,,,,,P,prés,,,10760,-0.823033,48.559031
2021-850699,2021-04-23,000001,Vente,38845,,,LA GUYARDIERE,B173,50720,50462,Saint-Cyr-du-Bailleul,50,,,504620000B1021,,,,,,,,,,,,,0,,,,,J,jardins,,,1240,-0.825924,48.560123
2021-850699,2021-04-23,000001,Vente,38845,,,LA GUYARDIERE,B173,50720,50462,Saint-Cyr-du-Bailleul,50,,,504620000B1022,,,,,,,,,,,,,0,,,,,S,sols,,,191,-0.825649,48.560288
2021-850699,2021-04-23,000001,Vente,38845,,,LA GUYARDIERE,B173,50720,50462,Saint-Cyr-du-Bailleul,50,,,504620000B1026,,,,,,,,,,,,,0,,,,,VE,vergers,,,555,-0.82559,48.559945
2021-850699,2021-04-23,000001,Vente,38845,,,LE CLOS MERIC,B559,50720,50462,Saint-Cyr-du-Bailleul,50,,,504620000B1032,,,,,,,,,,,,,0,,,,,P,prés,,,4400,-0.823942,48.559783
2021-850699,2021-04-23,000001,Vente,38845,,,LA GUYARDIERE,B173,50720,50462,Saint-Cyr-du-Bailleul,50,,,504620000B1033,,,,,,,,,,,,,0,,,,,J,jardins,,,925,-0.824828,48.560091
2021-850699,2021-04-23,000001,Vente,38845,5132,,LE HAUT BOULAY,B695,50720,50462,Saint-Cyr-du-Bailleul,50,,,504620000B1034,,,,,,,,,,,,,0,1,Maison,83,4,S,sols,,,475,-0.825084,48.56015
2021-850699,2021-04-23,000001,Vente,38845,,,LA GUYARDIERE,B173,50720,50462,Saint-Cyr-du-Bailleul,50,,,504620000B1035,,,,,,,,,,,,,0,,,,,S,sols,,,500,-0.825405,48.560205
2021-850699,2021-04-23,000001,Vente,38845,,,LE HAUT BOULAY,B695,50720,50462,Saint-Cyr-du-Bailleul,50,,,504620000B1036,,,,,,,,,,,,,0,,,,,S,sols,,,52,-0.825552,48.560412
2021-850699,2021-04-23,000001,Vente,38845,,,LE HAUT BOULAY,B695,50720,50462,Saint-Cyr-du-Bailleul,50,,,504620000B1037,,,,,,,,,,,,,0,,,,,P,prés,,,1103,-0.825229,48.560344
2021-850793,2021-04-27,000001,Vente,32500,5009,,LE BOURG,B285,50720,50462,Saint-Cyr-du-Bailleul,50,,,50462000AB0165,,,,,,,,,,,,,0,1,Maison,71,3,S,sols,,,68,-0.798158,48.564598
2021-850793,2021-04-27,000001,Vente,32500,,,LE BOURG,B285,50720,50462,Saint-Cyr-du-Bailleul,50,,,50462000AB0234,,,,,,,,,,,,,0,,,,,S,sols,,,242,-0.798046,48.564705
2021-850893,2021-05-11,000001,Vente,110000,,,LE CLOS JEAN,B508,50720,50462,Saint-Cyr-du-Bailleul,50,,,504620000C0560,,,,,,,,,,,,,0,,,,,P,prés,,,3170,-0.836236,48.56393
2021-850893,2021-05-11,000001,Vente,110000,,,LE GRAND PRE,B642,50720,50462,Saint-Cyr-du-Bailleul,50,,,504620000C0562,,,,,,,,,,,,,0,,,,,P,prés,,,5860,-0.835271,48.564174
2021-850893,2021-05-11,000001,Vente,110000,,,LE CLOSET,B492,50720,50462,Saint-Cyr-du-Bailleul,50,,,504620000C0575,,,,,,,,,,,,,0,,,,,VE,vergers,,,740,-0.834619,48.56444
2021-850893,2021-05-11,000001,Vente,110000,,,LE JARDIN,B709,50720,50462,Saint-Cyr-du-Bailleul,50,,,504620000C0577,,,,,,,,,,,,,0,,,,,P,prés,,,450,-0.834952,48.563721
2021-850893,2021-05-11,000001,Vente,110000,,,LA BULIERE,B052,50720,50462,Saint-Cyr-du-Bailleul,50,,,504620000C0578,,,,,,,,,,,,,0,,,,,J,jardins,,,174,-0.835035,48.563619
2021-850893,2021-05-11,000001,Vente,110000,,,LA BULIERE,B052,50720,50462,Saint-Cyr-du-Bailleul,50,,,504620000C0579,,,,,,,,,,,,,0,,,,,S,sols,,,720,-0.835004,48.563479
2021-850893,2021-05-11,000001,Vente,110000,,,LA BULIERE,B052,50720,50462,Saint-Cyr-du-Bailleul,50,,,504620000C0702,,,,,,,,,,,,,0,,,,,S,sols,,,40,-0.834979,48.562952
2021-850893,2021-05-11,000001,Vente,110000,,,LA BULIERE,B052,50720,50462,Saint-Cyr-du-Bailleul,50,,,504620000C0720,,,,,,,,,,,,,0,,,,,P,prés,,,2042,-0.835245,48.563248
2021-850893,2021-05-11,000001,Vente,110000,5246,,LA BULIERE,B052,50720,50462,Saint-Cyr-du-Bailleul,50,,,504620000C0721,,,,,,,,,,,,,0,1,Maison,104,6,S,sols,,,1145,-0.835618,48.563673
2021-850893,2021-05-11,000001,Vente,110000,,,LE CHAMP DES PRUNIERS,B404,50720,50462,Saint-Cyr-du-Bailleul,50,,,504620000C0722,,,,,,,,,,,,,0,,,,,VE,vergers,,,10345,-0.836488,48.56315
2021-850893,2021-05-11,000001,Vente,110000,,,LE GRAND PRE,B642,50720,50462,Saint-Cyr-du-Bailleul,50,,,504620000C1326,,,,,,,,,,,,,0,,,,,P,prés,,,540,-0.834849,48.564223
2021-853545,2021-05-17,000001,Vente,30000,,,LA HERCERIE,B185,50720,50462,Saint-Cyr-du-Bailleul,50,,,504620000D0685,,,,,,,,,,,,,0,,,,,S,sols,,,82,-0.858209,48.589533
2021-853545,2021-05-17,000001,Vente,30000,,,LA HERCERIE,B185,50720,50462,Saint-Cyr-du-Bailleul,50,,,504620000D0691,,,,,,,,,,,,,0,,,,,S,sols,,,130,-0.858105,48.589688
2021-853545,2021-05-17,000001,Vente,30000,,,LA HERCERIE,B185,50720,50462,Saint-Cyr-du-Bailleul,50,,,504620000D0692,,,,,,,,,,,,,0,,,,,VE,vergers,,,315,-0.858115,48.589806
2021-853545,2021-05-17,000001,Vente,30000,5294,,LA HERCERIE,B185,50720,50462,Saint-Cyr-du-Bailleul,50,,,504620000D0693,,,,,,,,,,,,,0,1,Maison,199,4,S,sols,,,230,-0.857922,48.589774
2021-853545,2021-05-17,000001,Vente,30000,5294,,LA HERCERIE,B185,50720,50462,Saint-Cyr-du-Bailleul,50,,,504620000D0693,,,,,,,,,,,,,0,3,Dépendance,,0,S,sols,,,230,-0.857922,48.589774
2021-853545,2021-05-17,000001,Vente,30000,,,LA HERCERIE,B185,50720,50462,Saint-Cyr-du-Bailleul,50,,,504620000D0694,,,,,,,,,,,,,0,,,,,VE,vergers,,,450,-0.857705,48.589858
2021-853545,2021-05-17,000001,Vente,30000,,,LA HERCERIE,B185,50720,50462,Saint-Cyr-du-Bailleul,50,,,504620000D0695,,,,,,,,,,,,,0,,,,,S,sols,,,22,-0.85759,48.58993
2021-853545,2021-05-17,000001,Vente,30000,,,LA HERCERIE,B185,50720,50462,Saint-Cyr-du-Bailleul,50,,,504620000D0703,,,,,,,,,,,,,0,,,,,S,sols,,,63,-0.857472,48.589506
2021-853545,2021-05-17,000001,Vente,30000,,,LA HERCERIE,B185,50720,50462,Saint-Cyr-du-Bailleul,50,,,504620000D0705,,,,,,,,,,,,,0,,,,,VE,vergers,,,120,-0.857681,48.589428
2021-853545,2021-05-17,000001,Vente,30000,,,LA HERCERIE,B185,50720,50462,Saint-Cyr-du-Bailleul,50,,,504620000D1094,,,,,,,,,,,,,0,,,,,S,sols,,,22,-0.857687,48.589737
2021-853545,2021-05-17,000001,Vente,30000,,,LA HERCERIE,B185,50720,50462,Saint-Cyr-du-Bailleul,50,,,504620000D1096,,,,,,,,,,,,,0,,,,,S,sols,,,160,-0.857641,48.589669
2021-853545,2021-05-17,000001,Vente,30000,,,LA HERCERIE,B185,50720,50462,Saint-Cyr-du-Bailleul,50,,,504620000D1099,,,,,,,,,,,,,0,,,,,S,sols,,,27,-0.858323,48.589625
2021-853545,2021-05-17,000001,Vente,30000,,,LE BOURG,B285,50720,50462,Saint-Cyr-du-Bailleul,50,,,504620000D1100,,,,,,,,,,,,,0,,,,,S,sols,,,465,-0.858257,48.589434
2021-853545,2021-05-17,000001,Vente,30000,,,LA HERCERIE,B185,50720,50462,Saint-Cyr-du-Bailleul,50,,,504620000D1102,,,,,,,,,,,,,0,,,,,VE,vergers,,,118,-0.857549,48.589812
2021-853545,2021-05-17,000001,Vente,30000,,,LA HERCERIE,B185,50720,50462,Saint-Cyr-du-Bailleul,50,,,504620000D1105,,,,,,,,,,,,,0,,,,,S,sols,,,71,-0.857467,48.589668
2021-853545,2021-05-17,000001,Vente,30000,,,LA HERCERIE,B185,50720,50462,Saint-Cyr-du-Bailleul,50,,,504620000D1107,,,,,,,,,,,,,0,,,,,P,prés,,,75,-0.857342,48.589511
2021-853545,2021-05-17,000001,Vente,30000,,,LA HERCERIE,B185,50720,50462,Saint-Cyr-du-Bailleul,50,,,504620000D1108,,,,,,,,,,,,,0,,,,,P,prés,,,22,-0.857303,48.589547
2021-853545,2021-05-17,000001,Vente,30000,,,LA HERCERIE,B185,50720,50462,Saint-Cyr-du-Bailleul,50,,,504620000D1109,,,,,,,,,,,,,0,,,,,S,sols,,,111,-0.857408,48.589493
2021-853545,2021-05-17,000001,Vente,30000,,,LA HERCERIE,B185,50720,50462,Saint-Cyr-du-Bailleul,50,,,504620000D1111,,,,,,,,,,,,,0,,,,,S,sols,,,218,-0.857573,48.589498
2021-853545,2021-05-17,000001,Vente,30000,,,LA HERCERIE,B185,50720,50462,Saint-Cyr-du-Bailleul,50,,,504620000D1113,,,,,,,,,,,,,0,,,,,P,prés,,,14,-0.857805,48.589385
2021-853545,2021-05-17,000001,Vente,30000,,,LA HERCERIE,B185,50720,50462,Saint-Cyr-du-Bailleul,50,,,504620000D1116,,,,,,,,,,,,,0,,,,,S,sols,,,887,-0.857907,48.589559
2021-853545,2021-05-17,000001,Vente,30000,,,LA HERCERIE,B185,50720,50462,Saint-Cyr-du-Bailleul,50,,,504620000D1117,,,,,,,,,,,,,0,,,,,S,sols,,,33,-0.85812,48.589393
2021-853546,2021-05-18,000001,Vente,14000,5269,,LA BULIERE,B052,50720,50462,Saint-Cyr-du-Bailleul,50,,,504620000C0580,,,,,,,,,,,,,0,1,Maison,69,1,S,sols,,,1550,-0.834595,48.563108
2021-853546,2021-05-18,000001,Vente,14000,,,LA BULIERE,B052,50720,50462,Saint-Cyr-du-Bailleul,50,,,504620000C0699,,,,,,,,,,,,,0,,,,,S,sols,,,155,-0.834654,48.562735
2021-853548,2021-05-19,000001,Vente,36100,5024,A,LE BOURG,B285,50720,50462,Saint-Cyr-du-Bailleul,50,,,50462000AB0201,,,,,,,,,,,,,0,1,Maison,30,0,S,sols,,,289,-0.800879,48.564736
2021-853548,2021-05-19,000001,Vente,36100,5024,A,LE BOURG,B285,50720,50462,Saint-Cyr-du-Bailleul,50,,,50462000AB0201,,,,,,,,,,,,,0,3,Dépendance,,0,S,sols,,,289,-0.800879,48.564736
2021-853845,2021-05-20,000001,Vente,33500,,,LE JARRY,B711,50720,50462,Saint-Cyr-du-Bailleul,50,,,504620000D0135,,,,,,,,,,,,,0,,,,,P,prés,,,1797,-0.851168,48.573242
2021-853845,2021-05-20,000001,Vente,33500,,,LE JARRY,B711,50720,50462,Saint-Cyr-du-Bailleul,50,,,504620000D0136,,,,,,,,,,,,,0,,,,,S,sols,,,420,-0.850831,48.572831
2021-853845,2021-05-20,000001,Vente,33500,,,LE JARRY,B711,50720,50462,Saint-Cyr-du-Bailleul,50,,,504620000D0137,,,,,,,,,,,,,0,,,,,J,jardins,,,684,-0.850555,48.57262
2021-853845,2021-05-20,000001,Vente,33500,5271,,LE JARRY,B711,50720,50462,Saint-Cyr-du-Bailleul,50,,,504620000D0138,,,,,,,,,,,,,0,1,Maison,86,2,S,sols,,,336,-0.850596,48.5725
2021-855304,2021-06-15,000005,Echange,8000,,,LA BRUYERE,B045,50720,50462,Saint-Cyr-du-Bailleul,50,,,504620000C0334,,,,,,,,,,,,,0,,,,,P,prés,,,6375,-0.84971,48.548731
2021-855513,2021-06-26,000001,Vente,110000,5390,,LES LANDES,B955,50720,50462,Saint-Cyr-du-Bailleul,50,,,504620000D0844,,,,,,,,,,,,,0,3,Dépendance,,0,S,sols,,,1050,-0.850454,48.573064
2021-855513,2021-06-26,000001,Vente,110000,5390,,LES LANDES,B955,50720,50462,Saint-Cyr-du-Bailleul,50,,,504620000D0844,,,,,,,,,,,,,0,3,Dépendance,,0,S,sols,,,1050,-0.850454,48.573064
2021-855513,2021-06-26,000001,Vente,110000,5390,,LES LANDES,B955,50720,50462,Saint-Cyr-du-Bailleul,50,,,504620000D0844,,,,,,,,,,,,,0,1,Maison,62,4,S,sols,,,1050,-0.850454,48.573064
2021-855513,2021-06-26,000001,Vente,110000,5390,,LES LANDES,B955,50720,50462,Saint-Cyr-du-Bailleul,50,,,504620000D0844,,,,,,,,,,,,,0,3,Dépendance,,0,S,sols,,,1050,-0.850454,48.573064
2021-855513,2021-06-26,000001,Vente,110000,,,LE JARRY,B711,50720,50462,Saint-Cyr-du-Bailleul,50,,,504620000D0845,,,,,,,,,,,,,0,,,,,J,jardins,,,260,-0.85039,48.572938
2021-855513,2021-06-26,000001,Vente,110000,5390,,LES LANDES,B955,50720,50462,Saint-Cyr-du-Bailleul,50,,,504620000D1074,,,,,,,,,,,,,0,,,,,S,sols,,,682,-0.85043,48.573165
2021-855881,2021-07-20,000001,Vente,85000,,,LA GUENILLERE,B169,50720,50462,Saint-Cyr-du-Bailleul,50,,,504620000B0561,,,,,,,,,,,,,0,,,,,J,jardins,,,265,-0.81474,48.557607
2021-855881,2021-07-20,000001,Vente,85000,,,LA GUENILLERE,B169,50720,50462,Saint-Cyr-du-Bailleul,50,,,504620000B0562,,,,,,,,,,,,,0,,,,,S,sols,,,140,-0.814402,48.557654
2021-855881,2021-07-20,000001,Vente,85000,,,LA GUENILLERE,B169,50720,50462,Saint-Cyr-du-Bailleul,50,,,504620000B0563,,,,,,,,,,,,,0,,,,,S,sols,,,70,-0.814429,48.557597
2021-855881,2021-07-20,000001,Vente,85000,,,LA GUENILLERE,B169,50720,50462,Saint-Cyr-du-Bailleul,50,,,504620000B0564,,,,,,,,,,,,,0,,,,,J,jardins,,,320,-0.814752,48.557517
2021-855881,2021-07-20,000001,Vente,85000,5141,,LA GUENILLERE,B169,50720,50462,Saint-Cyr-du-Bailleul,50,,,504620000B0565,,,,,,,,,,,,,0,1,Maison,71,4,S,sols,,,355,-0.81435,48.557517
2021-855881,2021-07-20,000001,Vente,85000,5141,,LA GUENILLERE,B169,50720,50462,Saint-Cyr-du-Bailleul,50,,,504620000B0565,,,,,,,,,,,,,0,3,Dépendance,,0,S,sols,,,355,-0.81435,48.557517
2021-855881,2021-07-20,000001,Vente,85000,5141,,LA GUENILLERE,B169,50720,50462,Saint-Cyr-du-Bailleul,50,,,504620000B0565,,,,,,,,,,,,,0,3,Dépendance,,0,S,sols,,,355,-0.81435,48.557517
2021-857262,2021-07-26,000001,Vente,145000,5394,,LA COUPELIERE,B090,50720,50462,Saint-Cyr-du-Bailleul,50,,,504620000A0332,,,,,,,,,,,,,0,3,Dépendance,,0,S,sols,,,500,-0.787241,48.575921
2021-857262,2021-07-26,000001,Vente,145000,5394,,LA COUPELIERE,B090,50720,50462,Saint-Cyr-du-Bailleul,50,,,504620000A0332,,,,,,,,,,,,,0,1,Maison,120,3,S,sols,,,500,-0.787241,48.575921
2021-857262,2021-07-26,000001,Vente,145000,5394,,LA COUPELIERE,B090,50720,50462,Saint-Cyr-du-Bailleul,50,,,504620000A0332,,,,,,,,,,,,,0,3,Dépendance,,0,S,sols,,,500,-0.787241,48.575921
2021-857262,2021-07-26,000001,Vente,145000,5394,,LA COUPELIERE,B090,50720,50462,Saint-Cyr-du-Bailleul,50,,,504620000A0332,,,,,,,,,,,,,0,1,Maison,120,3,AG,terrains d'agrément,,,1470,-0.787241,48.575921
2021-857262,2021-07-26,000001,Vente,145000,5394,,LA COUPELIERE,B090,50720,50462,Saint-Cyr-du-Bailleul,50,,,504620000A0332,,,,,,,,,,,,,0,3,Dépendance,,0,AG,terrains d'agrément,,,1470,-0.787241,48.575921
2021-857262,2021-07-26,000001,Vente,145000,5394,,LA COUPELIERE,B090,50720,50462,Saint-Cyr-du-Bailleul,50,,,504620000A0332,,,,,,,,,,,,,0,3,Dépendance,,0,AG,terrains d'agrément,,,1470,-0.787241,48.575921
2021-857262,2021-07-26,000001,Vente,145000,,,LA COUPELIERE,B090,50720,50462,Saint-Cyr-du-Bailleul,50,,,504620000A0333,,,,,,,,,,,,,0,,,,,S,sols,,,18,-0.786988,48.576148
2021-857262,2021-07-26,000001,Vente,145000,,,LA COUPELIERE,B090,50720,50462,Saint-Cyr-du-Bailleul,50,,,504620000A0334,,,,,,,,,,,,,0,,,,,J,jardins,,,1282,-0.786819,48.576193
2021-857262,2021-07-26,000001,Vente,145000,,,LA COUPELIERE,B090,50720,50462,Saint-Cyr-du-Bailleul,50,,,504620000A0335,,,,,,,,,,,,,0,,,,,J,jardins,,,838,-0.786569,48.576085
2021-858880,2021-09-02,000001,Vente,160000,5139,,MONGODIN,B977,50720,50462,Saint-Cyr-du-Bailleul,50,,,504620000B0903,,,,,,,,,,,,,0,1,Maison,110,4,S,sols,,,816,-0.820658,48.554966
2021-858880,2021-09-02,000001,Vente,160000,5139,,MONGODIN,B977,50720,50462,Saint-Cyr-du-Bailleul,50,,,504620000B0903,,,,,,,,,,,,,0,3,Dépendance,,0,S,sols,,,816,-0.820658,48.554966
2021-858880,2021-09-02,000001,Vente,160000,,,LA CHATAIGNERAIE,B059,50720,50462,Saint-Cyr-du-Bailleul,50,,,504620000B1344,,,,,,,,,,,,,0,,,,,P,prés,,,372,-0.820614,48.555095
2021-859526,2021-09-16,000001,Vente,55000,5062,,LE BOURG,B285,50720,50462,Saint-Cyr-du-Bailleul,50,,,50462000AB0068,,,,,,,,,,,,,0,1,Maison,70,3,S,sols,,,60,-0.800049,48.565788
2021-859526,2021-09-16,000001,Vente,55000,,,LE BOURG,B285,50720,50462,Saint-Cyr-du-Bailleul,50,,,50462000AB0309,,,,,,,,,,,,,0,,,,,S,sols,,,63,-0.800089,48.565818
2021-859796,2021-09-27,000001,Vente,500,,,LA BRUGERETTE,B046,50720,50462,Saint-Cyr-du-Bailleul,50,,,504620000B0558,,,,,,,,,,,,,0,,,,,P,prés,,,1900,-0.815718,48.557776
2021-860131,2021-10-04,000001,Vente,85500,,,MONGODIN,B977,50720,50462,Saint-Cyr-du-Bailleul,50,,,504620000B0831,,,,,,,,,,,,,0,,,,,J,jardins,,,860,-0.819961,48.55528
2021-860131,2021-10-04,000001,Vente,85500,5135,,MONGODIN,B977,50720,50462,Saint-Cyr-du-Bailleul,50,,,504620000B1276,,,,,,,,,,,,,0,1,Maison,60,1,S,sols,,,561,-0.819792,48.555246
2021-860162,2021-09-29,000001,Vente,13178.7,,,LA GRANDE LEVEE,B141,50720,50462,Saint-Cyr-du-Bailleul,50,,,504620000A0065,,,,,,,,,,,,,0,,,,,P,prés,,,6408,-0.798719,48.580211
2021-860162,2021-09-29,000001,Vente,13178.7,,,LE PRE DE LA FRIETTE,B771,50720,50462,Saint-Cyr-du-Bailleul,50,,,504620000A0070,,,,,,,,,,,,,0,,,,,P,prés,,,2380,-0.799297,48.581813
2021-860162,2021-09-29,000001,Vente,13178.7,,,LA LANDE,B191,50720,50462,Saint-Cyr-du-Bailleul,50,,,504620000A0072,,,,,,,,,,,,,0,,,,,P,prés,,,8580,-0.797843,48.582515
2021-860162,2021-09-29,000001,Vente,13178.7,,,LA LANDE,B191,50720,50462,Saint-Cyr-du-Bailleul,50,,,504620000A0758,,,,,,,,,,,,,0,,,,,P,prés,,,5510,-0.79667,48.581225
2021-860609,2021-10-08,000002,Vente,39700,,,LE GRAND CHAMP,B644,50720,50462,Saint-Cyr-du-Bailleul,50,,,504620000B0084,,,,,,,,,,,,,0,,,,,P,prés,,,4408,-0.803169,48.562334
2021-860609,2021-10-08,000002,Vente,39700,,,LE CLOS,B499,50720,50462,Saint-Cyr-du-Bailleul,50,,,504620000B0159,,,,,,,,,,,,,0,,,,,P,prés,,,2855,-0.811588,48.563054
2021-860609,2021-10-08,000002,Vente,39700,,,LA CHEMINIERE,B071,50720,50462,Saint-Cyr-du-Bailleul,50,,,504620000B0179,,,,,,,,,,,,,0,,,,,P,prés,,,7750,-0.812999,48.562787
2021-860609,2021-10-08,000002,Vente,39700,,,LA CHEMINIERE,B071,50720,50462,Saint-Cyr-du-Bailleul,50,,,504620000B0181,,,,,,,,,,,,,0,,,,,P,prés,,,2340,-0.814082,48.563259
2021-860609,2021-10-08,000002,Vente,39700,,,LA CHEMINIERE,B071,50720,50462,Saint-Cyr-du-Bailleul,50,,,504620000B0182,,,,,,,,,,,,,0,,,,,P,prés,,,8670,-0.812765,48.563342
2021-860609,2021-10-08,000002,Vente,39700,,,LE GRAND PRE DU CLOSET,B669,50720,50462,Saint-Cyr-du-Bailleul,50,,,504620000B1470,,,,,,,,,,,,,0,,,,,P,prés,,,5740,-0.81109,48.562462
2021-860609,2021-10-08,000002,Vente,39700,,,LA CHEMINIERE,B071,50720,50462,Saint-Cyr-du-Bailleul,50,,,504620000B1472,,,,,,,,,,,,,0,,,,,P,prés,,,5129,-0.812473,48.562348
2021-860609,2021-10-08,000002,Vente,39700,,,LE GRAND PRE DU CLOSET,B669,50720,50462,Saint-Cyr-du-Bailleul,50,,,504620000B1474,,,,,,,,,,,,,0,,,,,P,prés,,,690,-0.811935,48.562942
2021-860630,2021-10-08,000001,Vente,9030,,,LE PRE DE LA SAGERIE,B852,50720,50462,Saint-Cyr-du-Bailleul,50,,,504620000C0005,,,,,,,,,,,,,0,,,,,P,prés,,,2870,-0.86225,48.555301
2021-860630,2021-10-08,000001,Vente,9030,,,LE PRE DE LA SAGERIE,B852,50720,50462,Saint-Cyr-du-Bailleul,50,,,504620000C0016,,,,,,,,,,,,,0,,,,,P,prés,,,5340,-0.862289,48.55608
2021-860630,2021-10-08,000001,Vente,9030,,,LE TERTRE,B980,50720,50462,Saint-Cyr-du-Bailleul,50,,,504620000C0436,,,,,,,,,,,,,0,,,,,P,prés,,,25270,-0.861001,48.553903
2021-860630,2021-10-08,000001,Vente,9030,,,LE CHAMP DE DEVANT,B328,50720,50462,Saint-Cyr-du-Bailleul,50,,,504620000C0437,,,,,,,,,,,,,0,,,,,S,sols,,,28,-0.861536,48.554209
2021-860630,2021-10-08,000001,Vente,9030,,,LE TERTRE,B980,50720,50462,Saint-Cyr-du-Bailleul,50,,,504620000C0440,,,,,,,,,,,,,0,,,,,BT,taillis simples,,,1898,-0.860974,48.554863
2021-860630,2021-10-08,000001,Vente,9030,,,LE PRE DE LA SAGERIE,B852,50720,50462,Saint-Cyr-du-Bailleul,50,,,504620000C0442,,,,,,,,,,,,,0,,,,,P,prés,,,1330,-0.862072,48.554634
2021-860631,2021-10-08,000002,Vente,270,,,LE PRE DE LA SAGERIE,B852,50720,50462,Saint-Cyr-du-Bailleul,50,,,504620000C0007,,,,,,,,,,,,,0,,,,,P,prés,,,380,-0.861245,48.555102
2021-860631,2021-10-08,000002,Vente,270,,,LE PRE DE LA SAGERIE,B852,50720,50462,Saint-Cyr-du-Bailleul,50,,,504620000C0011,,,,,,,,,,,,,0,,,,,BT,taillis simples,,,720,-0.861394,48.555327
2021-860906,2021-10-13,000001,Vente,5500,,,LA BRUYERE,B045,50720,50462,Saint-Cyr-du-Bailleul,50,,,504620000C0334,,,,,,,,,,,,,0,,,,,P,prés,,,6375,-0.84971,48.548731
2021-861131,2021-10-19,000001,Vente,18360,5055,,LE BOURG,B285,50720,50462,Saint-Cyr-du-Bailleul,50,,,50462000AB0085,,,,,,,,,,,,,0,1,Maison,45,3,S,sols,,,93,-0.801252,48.567183
2021-861226,2021-11-03,000001,Echange,2350,,,LA BREBILLETTE,B043,50720,50462,Saint-Cyr-du-Bailleul,50,,,504620000B0625,,,,,,,,,,,,,0,,,,,P,prés,,,2770,-0.805629,48.555953
2021-861227,2021-11-03,000002,Echange,5625,,,LE CHAMP DE DEROUE,B360,50720,50462,Saint-Cyr-du-Bailleul,50,,,504620000B1386,,,,,,,,,,,,,0,,,,,P,prés,,,6619,-0.808564,48.553892
2021-861242,2021-10-22,000001,Vente,20000,,,LE CHAMP DE LA PRAIRIE,B416,50720,50462,Saint-Cyr-du-Bailleul,50,,,504620000C1129,,,,,,,,,,,,,0,,,,,P,prés,,,16640,-0.825404,48.56948
2021-861242,2021-10-22,000001,Vente,20000,,,LA MOTTE,B225,50720,50462,Saint-Cyr-du-Bailleul,50,,,504620000C1130,,,,,,,,,,,,,0,,,,,P,prés,,,3120,-0.82671,48.570007
2021-861585,2021-11-02,000002,Echange,3801,,,LA COURSIERE,B091,50720,50462,Saint-Cyr-du-Bailleul,50,,,504620000A0937,,,,,,,,,,,,,0,,,,,T,terres,,,2484,-0.782682,48.582983
2021-862264,2021-11-19,000001,Vente,87000,,,LE BOURG,B285,50720,50462,Saint-Cyr-du-Bailleul,50,,,50462000AB0047,,,,,,,,,,,,,0,,,,,J,jardins,,,233,-0.801067,48.565939
2021-862264,2021-11-19,000001,Vente,87000,5080,,LE BOURG,B285,50720,50462,Saint-Cyr-du-Bailleul,50,,,50462000AB0051,,,,,,,,,,,,,0,1,Maison,122,4,S,sols,,,74,-0.800685,48.565631
2021-862264,2021-11-19,000001,Vente,87000,5080,,LE BOURG,B285,50720,50462,Saint-Cyr-du-Bailleul,50,,,50462000AB0051,,,,,,,,,,,,,0,3,Dépendance,,0,S,sols,,,74,-0.800685,48.565631
2021-862264,2021-11-19,000001,Vente,87000,5080,,LE BOURG,B285,50720,50462,Saint-Cyr-du-Bailleul,50,,,50462000AB0051,,,,,,,,,,,,,0,3,Dépendance,,0,S,sols,,,74,-0.800685,48.565631
2021-862264,2021-11-19,000001,Vente,87000,,,LE BOURG,B285,50720,50462,Saint-Cyr-du-Bailleul,50,,,50462000AB0239,,,,,,,,,,,,,0,,,,,S,sols,,,7,-0.800816,48.56601