id_mutation,date_mutation,numero_disposition,nature_mutation,valeur_fonciere,adresse_numero,adresse_suffixe,adresse_nom_voie,adresse_code_voie,code_postal,code_commune,nom_commune,code_departement,ancien_code_commune,ancien_nom_commune,id_parcelle,ancien_id_parcelle,numero_volume,lot1_numero,lot1_surface_carrez,lot2_numero,lot2_surface_carrez,lot3_numero,lot3_surface_carrez,lot4_numero,lot4_surface_carrez,lot5_numero,lot5_surface_carrez,nombre_lots,code_type_local,type_local,surface_reelle_bati,nombre_pieces_principales,code_nature_culture,nature_culture,code_nature_culture_speciale,nature_culture_speciale,surface_terrain,longitude,latitude
2021-848317,2021-01-12,000001,Vente,100000,90,,RUE RENE LAENNEC,2478,50000,50502,Saint-Lô,50,,,50502000CP0163,,,,,,,,,,,,,0,1,Maison,86,5,S,sols,,,534,-1.078159,49.109442
2021-848318,2021-01-05,000001,Vente,151250,48,,PL DU CHAMP DE MARS,0570,50000,50502,Saint-Lô,50,,,50502000AO0045,,,39,98.99,,,,,,,,,1,2,Appartement,77,4,,,,,,-1.085633,49.117142
2021-848327,2021-01-07,000001,Vente,151500,25,,RUE GERICAULT,1151,50000,50502,Saint-Lô,50,,,50502000CM0053,,,,,,,,,,,,,0,1,Maison,89,5,S,sols,,,501,-1.085671,49.101696
2021-848332,2021-01-13,000001,Vente,43000,4,,RUE HOUSSIN DUMANOIR,1440,50000,50502,Saint-Lô,50,,,50502000AT0059,,,3,31.56,,,,,,,,,1,2,Appartement,27,1,,,,,,-1.09944,49.113036
2021-848332,2021-01-13,000001,Vente,43000,4,,RUE HOUSSIN DUMANOIR,1440,50000,50502,Saint-Lô,50,,,50502000AT0059,,,2,,,,,,,,,,1,3,Dépendance,,0,,,,,,-1.09944,49.113036
2021-848357,2021-01-05,000001,Vente,120000,16,,RUE DU PRE DE HAUT,2430,50000,50502,Saint-Lô,50,,,50502000AC0241,,,,,,,,,,,,,0,1,Maison,62,4,S,sols,,,347,-1.087403,49.119175
2021-848357,2021-01-05,000001,Vente,120000,,,RUE DU PRE DE HAUT,2430,50000,50502,Saint-Lô,50,,,50502000AC0243,,,,,,,,,,,,,0,,,,,S,sols,,,13,-1.087359,49.11922
2021-848362,2021-01-23,000001,Vente,71000,55,,RUE DE LA MAISON BLANCHE,1747,50000,50502,Saint-Lô,50,,,50502000CX0416,,,235,,,,,,,,,,1,3,Dépendance,,0,,,,,,-1.06048,49.1153
2021-848362,2021-01-23,000001,Vente,71000,55,,RUE DE LA MAISON BLANCHE,1747,50000,50502,Saint-Lô,50,,,50502000CX0416,,,20,50.5,,,,,,,,,1,2,Appartement,51,2,,,,,,-1.06048,49.1153
2021-848362,2021-01-23,000001,Vente,71000,55,,RUE DE LA MAISON BLANCHE,1747,50000,50502,Saint-Lô,50,,,50502000CX0416,,,122,,,,,,,,,,1,3,Dépendance,,0,,,,,,-1.06048,49.1153
2021-848365,2021-01-07,000001,Vente,5000,,,LE TRAVERSIN,C019,50000,50502,Saint-Lô,50,,,505020000D0812,,,,,,,,,,,,,0,,,,,P,prés,,,7936,-1.071486,49.131034
2021-848365,2021-01-07,000001,Vente,5000,,,LE JARDIN POINTU,B604,50000,50502,Saint-Lô,50,,,505020000D0814,,,,,,,,,,,,,0,,,,,P,prés,,,2,-1.07288,49.130723
2021-848365,2021-01-07,000001,Vente,5000,,,RTE D ISIGNY,1509,50000,50502,Saint-Lô,50,,,505020000D0817,,,,,,,,,,,,,0,,,,,P,prés,,,777,-1.071488,49.131149
2021-848366,2021-01-14,000001,Vente,6350,,,RUE GAMBE DE LOUP,1100,50000,50502,Saint-Lô,50,,,50502000CP0468,,,,,,,,,,,,,0,,,,,S,sols,,,14,-1.083858,49.110564
2021-848369,2021-01-20,000001,Vente,46000,80,,RUE MARECHAL LECLERC,1783,50000,50502,Saint-Lô,50,,,50502000AP0160,,,3,,7,,9,,,,,,3,2,Appartement,45,2,,,,,,-1.086873,49.114819
2021-848370,2021-01-12,000001,Vente,441000,4,,RUE CROIX AU CAPEL,0790,50000,50502,Saint-Lô,50,,,50502000AT0208,,,,,,,,,,,,,0,2,Appartement,96,3,S,sols,,,872,-1.092032,49.114288
2021-848370,2021-01-12,000001,Vente,441000,4,,RUE CROIX AU CAPEL,0790,50000,50502,Saint-Lô,50,,,50502000AT0208,,,,,,,,,,,,,0,3,Dépendance,,0,S,sols,,,872,-1.092032,49.114288
2021-848370,2021-01-12,000001,Vente,441000,4,,RUE CROIX AU CAPEL,0790,50000,50502,Saint-Lô,50,,,50502000AT0208,,,,,,,,,,,,,0,4,Local industriel. commercial ou assimilé,140,0,S,sols,,,872,-1.092032,49.114288
2021-848370,2021-01-12,000001,Vente,441000,4,,RUE CROIX AU CAPEL,0790,50000,50502,Saint-Lô,50,,,50502000AT0208,,,,,,,,,,,,,0,2,Appartement,59,2,S,sols,,,872,-1.092032,49.114288
2021-848370,2021-01-12,000001,Vente,441000,4,,RUE CROIX AU CAPEL,0790,50000,50502,Saint-Lô,50,,,50502000AT0208,,,,,,,,,,,,,0,2,Appartement,74,3,S,sols,,,872,-1.092032,49.114288
2021-848370,2021-01-12,000001,Vente,441000,4,,RUE CROIX AU CAPEL,0790,50000,50502,Saint-Lô,50,,,50502000AT0208,,,,,,,,,,,,,0,2,Appartement,53,2,S,sols,,,872,-1.092032,49.114288
2021-848370,2021-01-12,000001,Vente,441000,4,,RUE CROIX AU CAPEL,0790,50000,50502,Saint-Lô,50,,,50502000AT0208,,,,,,,,,,,,,0,2,Appartement,14,1,S,sols,,,872,-1.092032,49.114288
2021-848370,2021-01-12,000001,Vente,441000,4,,RUE CROIX AU CAPEL,0790,50000,50502,Saint-Lô,50,,,50502000AT0208,,,,,,,,,,,,,0,2,Appartement,53,2,S,sols,,,872,-1.092032,49.114288
2021-848370,2021-01-12,000001,Vente,441000,4,,RUE CROIX AU CAPEL,0790,50000,50502,Saint-Lô,50,,,50502000AT0208,,,,,,,,,,,,,0,2,Appartement,14,1,S,sols,,,872,-1.092032,49.114288
2021-848370,2021-01-12,000001,Vente,441000,,,RUE CROIX AU CAPEL,0790,50000,50502,Saint-Lô,50,,,50502000AT0209,,,,,,,,,,,,,0,,,,,S,sols,,,712,-1.092379,49.114387
2021-848374,2021-01-15,000001,Vente,142000,111,,RUE MAL DE LATTRE DE TASSIGNY,1781,50000,50502,Saint-Lô,50,,,50502000CY0149,,,,,,,,,,,,,0,1,Maison,102,4,S,sols,,,309,-1.076775,49.11162
2021-848374,2021-01-15,000001,Vente,142000,,,RUE MAL DE LATTRE DE TASSIGNY,1781,50000,50502,Saint-Lô,50,,,50502000CY0150,,,,,,,,,,,,,0,,,,,S,sols,,,275,-1.076299,49.111483
2021-848376,2021-01-14,000001,Vente,300000,90,,RUE SAMUEL BECKETT,2592,50000,50502,Saint-Lô,50,,,50502000CI0001,,,91,,,,,,,,,,1,3,Dépendance,,0,,,,,,-1.103378,49.1039
2021-848376,2021-01-14,000001,Vente,300000,90,,RUE SAMUEL BECKETT,2592,50000,50502,Saint-Lô,50,,,50502000CI0001,,,90,,,,,,,,,,1,3,Dépendance,,0,,,,,,-1.103378,49.1039
2021-848376,2021-01-14,000001,Vente,300000,90,,RUE SAMUEL BECKETT,2592,50000,50502,Saint-Lô,50,,,50502000CI0001,,,53,62.82,,,,,,,,,1,2,Appartement,62,3,,,,,,-1.103378,49.1039
2021-848376,2021-01-14,000001,Vente,300000,90,,RUE SAMUEL BECKETT,2592,50000,50502,Saint-Lô,50,,,50502000CI0001,,,96,,,,,,,,,,1,3,Dépendance,,0,,,,,,-1.103378,49.1039
2021-848376,2021-01-14,000001,Vente,300000,90,,RUE SAMUEL BECKETT,2592,50000,50502,Saint-Lô,50,,,50502000CI0001,,,72,62.9,,,,,,,,,1,2,Appartement,62,3,,,,,,-1.103378,49.1039
2021-848376,2021-01-14,000001,Vente,300000,90,,RUE SAMUEL BECKETT,2592,50000,50502,Saint-Lô,50,,,50502000CI0001,,,110,,,,,,,,,,1,3,Dépendance,,0,,,,,,-1.103378,49.1039
2021-848376,2021-01-14,000001,Vente,300000,90,,RUE SAMUEL BECKETT,2592,50000,50502,Saint-Lô,50,,,50502000CI0001,,,58,59.05,,,,,,,,,1,2,Appartement,59,3,,,,,,-1.103378,49.1039
2021-848379,2021-01-22,000001,Vente,41000,7,,IMP DU GUET,1225,50000,50502,Saint-Lô,50,,,50502000CH0189,,,148,22.09,,,,,,,,,1,2,Appartement,22,1,,,,,,-1.092851,49.109269
2021-848379,2021-01-22,000001,Vente,41000,9335,,IMP DU GUET,1225,50000,50502,Saint-Lô,50,,,50502000CH0189,,,112,,,,,,,,,,1,3,Dépendance,,0,,,,,,-1.092851,49.109269
2021-848380,2021-01-26,000001,Vente,140000,45,,RUE DE VILLEDIEU,2900,50000,50502,Saint-Lô,50,,,50502000AT0440,,,,,,,,,,,,,0,4,Local industriel. commercial ou assimilé,95,0,S,sols,,,224,-1.099443,49.113209
2021-848380,2021-01-26,000001,Vente,140000,45,,RUE DE VILLEDIEU,2900,50000,50502,Saint-Lô,50,,,50502000AT0440,,,,,,,,,,,,,0,2,Appartement,49,2,S,sols,,,224,-1.099443,49.113209
2021-848380,2021-01-26,000001,Vente,140000,45,,RUE DE VILLEDIEU,2900,50000,50502,Saint-Lô,50,,,50502000AT0440,,,,,,,,,,,,,0,2,Appartement,49,2,S,sols,,,224,-1.099443,49.113209
2021-848383,2021-01-04,000001,Vente,37000,38,,RUE DES SOPHORAS,2609,50000,50502,Saint-Lô,50,,,50502000CY0131,,,63,,9,,,,,,,,2,2,Appartement,30,1,,,,,,-1.073,49.110738
2021-848393,2021-01-21,000001,Vente,89000,35,,RUE LOUIS ARMAND,1731,50000,50502,Saint-Lô,50,,,50502000CS0057,,,,,,,,,,,,,0,4,Local industriel. commercial ou assimilé,150,0,S,sols,,,166,-1.070635,49.103001
2021-848393,2021-01-21,000001,Vente,89000,,,RUE LOUIS ARMAND,1731,50000,50502,Saint-Lô,50,,,50502000CS0058,,,,,,,,,,,,,0,,,,,S,sols,,,155,-1.070686,49.103048
2021-848394,2021-01-18,000001,Vente,132000,,,RUE MAL DE LATTRE DE TASSIGNY,1781,50000,50502,Saint-Lô,50,,,50502000CY0150,,,,,,,,,,,,,0,,,,,S,sols,,,275,-1.076299,49.111483
2021-848394,2021-01-18,000001,Vente,132000,102,,RUE DE DUNKERQUE,0920,50000,50502,Saint-Lô,50,,,50502000CY0158,,,,,,,,,,,,,0,1,Maison,80,4,S,sols,,,344,-1.075883,49.111382
2021-848403,2021-01-26,000001,Vente,149516,39,,RUE CORNE DE CERF,0700,50000,50502,Saint-Lô,50,,,50502000AT0438,,,,,,,,,,,,,0,1,Maison,88,4,S,sols,,,82,-1.093524,49.112403
2021-848404,2021-01-26,000001,Vente,56700,211,,RUE DE LA FALAISE,0970,50000,50502,Saint-Lô,50,,,50502000AW0122,,,,,,,,,,,,,0,1,Maison,65,4,S,sols,,,217,-1.105254,49.114431
2021-848405,2021-01-05,000001,Vente,92000,3,,RUE DU PAIN DE SEIGLE,2090,50000,50502,Saint-Lô,50,,,50502000AT0695,,,50,,,,,,,,,,1,3,Dépendance,,0,,,,,,-1.09224,49.112043
2021-848405,2021-01-05,000001,Vente,92000,3,,RUE DU PAIN DE SEIGLE,2090,50000,50502,Saint-Lô,50,,,50502000AT0695,,,46,,6,40.4,,,,,,,2,2,Appartement,42,2,,,,,,-1.09224,49.112043
2021-848407,2021-01-06,000001,Vente,169000,107,,RUE DE LA FONTAINE,1029,50000,50502,Saint-Lô,50,,,50502000CL0114,,,,,,,,,,,,,0,1,Maison,100,4,S,sols,,,543,-1.085909,49.102185
2021-848409,2021-01-21,000001,Vente,41000,38,,RUE DES SOPHORAS,2609,50000,50502,Saint-Lô,50,,,50502000CY0131,,,103,29.91,49,,,,,,,,2,2,Appartement,30,1,,,,,,-1.073,49.110738
2021-848414,2021-01-07,000001,Vente,65000,90,,RUE SAMUEL BECKETT,2592,50000,50502,Saint-Lô,50,,,50502000CI0001,,,123,,,,,,,,,,1,3,Dépendance,,0,,,,,,-1.103378,49.1039
2021-848414,2021-01-07,000001,Vente,65000,90,,RUE SAMUEL BECKETT,2592,50000,50502,Saint-Lô,50,,,50502000CI0001,,,4,,,,,,,,,,1,2,Appartement,38,2,,,,,,-1.103378,49.1039
2021-848417,2021-01-23,000001,Vente,100000,,,RUE PORTE AU FOUR,2350,50000,50502,Saint-Lô,50,,,50502000AC0095,,,,,,,,,,,,,0,,,,,S,sols,,,116,-1.092432,49.118319
2021-848417,2021-01-23,000001,Vente,100000,11,,RUE PORTE AU FOUR,2350,50000,50502,Saint-Lô,50,,,50502000AC0142,,,,,,,,,,,,,0,1,Maison,95,4,S,sols,,,100,-1.092324,49.118326
2021-848417,2021-01-23,000001,Vente,100000,,,PL DES PALLIERS,2110,50000,50502,Saint-Lô,50,,,50502000AC0484,,,,,,,,,,,,,0,,,,,S,sols,,,13,-1.092301,49.118274
2021-848417,2021-01-23,000001,Vente,100000,13,,RUE PORTE AU FOUR,2350,50000,50502,Saint-Lô,50,,,50502000AC0792,,,,,,,,,,,,,0,,,,,S,sols,,,90,-1.092475,49.118351
2021-848428,2021-01-13,000001,Vente,42000,17,,RUE DES SORBIERS,2612,50000,50502,Saint-Lô,50,,,50502000CY0133,,,17,,71,29.54,,,,,,,2,2,Appartement,30,1,,,,,,-1.073682,49.109951
2021-848434,2021-01-29,000001,Vente,170000,64,,RUE LUC DIETRICH,1729,50000,50502,Saint-Lô,50,,,50502000CD0059,,,,,,,,,,,,,0,1,Maison,106,6,S,sols,,,547,-1.104413,49.107436
2021-848437,2021-01-15,000001,Vente,55000,44,,RUE DE VILLEDIEU,2900,50000,50502,Saint-Lô,50,,,50502000AW0347,,,,,,,,,,,,,0,1,Maison,60,3,S,sols,,,64,-1.100361,49.113064
2021-848454,2021-01-29,000001,Vente,100950,52,,RUE DE VILLEDIEU,2900,50000,50502,Saint-Lô,50,,,50502000AW0202,,,29,,3,58.95,,,,,,,2,2,Appartement,47,2,,,,,,-1.101368,49.112456
2021-848454,2021-01-29,000001,Vente,100950,52,,RUE DE VILLEDIEU,2900,50000,50502,Saint-Lô,50,,,50502000AW0202,,,66,,,,,,,,,,1,3,Dépendance,,0,,,,,,-1.101368,49.112456
2021-848455,2021-01-26,000001,Vente,126400,90,,RUE DU NEUFBOURG,2010,50000,50502,Saint-Lô,50,,,50502000AO0362,,,1,71.91,7,,,,,,,,2,2,Appartement,77,3,,,,,,-1.084115,49.115488
2021-848456,2021-01-28,000001,Vente,37500,,,HOTEL HEBERT,B408,50000,50502,Saint-Lô,50,,,50502000DA0070,,,,,,,,,,,,,0,,,,,J,jardins,,,1036,-1.099228,49.095102
2021-848456,2021-01-28,000001,Vente,37500,446,,CHEM DE LIGNEROLLES,1719,50000,50502,Saint-Lô,50,,,50502000DA0071,,,,,,,,,,,,,0,1,Maison,67,4,S,sols,,,431,-1.099041,49.09491
2021-848467,2021-01-20,000002,Vente,40625,9259,,RUE DES NOISETIERS,2018,50000,50502,Saint-Lô,50,,,50502000CW0141,,,,,,,,,,,,,0,4,Local industriel. commercial ou assimilé,2019,0,,,,,,-1.058318,49.114996
2021-848467,2021-01-20,000002,Vente,40625,,,RUE DES NOISETIERS,2018,50000,50502,Saint-Lô,50,,,50502000CW0144,,,,,,,,,,,,,0,,,,,S,sols,,,22,-1.058257,49.114746
2021-848468,2021-02-10,000001,Vente,63500,55,,RUE MARIN MARIE,1795,50000,50502,Saint-Lô,50,,,50502000CK0148,,,41,58.1,,,,,,,,,1,2,Appartement,58,3,,,,,,-1.10456,49.103206
2021-848468,2021-02-10,000001,Vente,63500,55,,RUE MARIN MARIE,1795,50000,50502,Saint-Lô,50,,,50502000CK0148,,,121,,,,,,,,,,1,3,Dépendance,,0,,,,,,-1.10456,49.103206
2021-848468,2021-02-10,000001,Vente,63500,55,,RUE MARIN MARIE,1795,50000,50502,Saint-Lô,50,,,50502000CK0148,,,122,,,,,,,,,,1,3,Dépendance,,0,,,,,,-1.10456,49.103206
2021-848483,2021-02-05,000001,Vente,120000,4,,RUE DU DOCTEUR LETURC,0855,50000,50502,Saint-Lô,50,,,50502000AO0021,,,9,113.87,,,,,,,,,1,4,Local industriel. commercial ou assimilé,108,0,,,,,,-1.089093,49.115945
2021-848495,2021-01-21,000001,Vente,110000,12,,RUE FALOURDEL,0990,50000,50502,Saint-Lô,50,,,50502000CE0044,,,,,,,,,,,,,0,,,,,S,sols,,,36,-1.100377,49.112382
2021-848495,2021-01-21,000001,Vente,110000,12,,RUE FALOURDEL,0990,50000,50502,Saint-Lô,50,,,50502000CE0045,,,,,,,,,,,,,0,1,Maison,100,5,S,sols,,,117,-1.100359,49.112434
2021-848500,2021-01-21,000001,Vente,96300,9001,,LE HAMEL AUBRE,B378,50000,50502,Saint-Lô,50,,,505020000E0300,,,,,,,,,,,,,0,1,Maison,120,3,S,sols,,,501,-1.040561,49.100898
2021-848500,2021-01-21,000001,Vente,96300,,,LE HAMEL AUBRE,B378,50000,50502,Saint-Lô,50,,,505020000E0301,,,,,,,,,,,,,0,,,,,J,jardins,POTAG,Jardin potager,340,-1.040242,49.100846
2021-848500,2021-01-21,000001,Vente,96300,,,LA BRETONNIERE,B060,50000,50502,Saint-Lô,50,,,505020000E0601,,,,,,,,,,,,,0,,,,,J,jardins,MARAI,Pré marais,355,-1.040795,49.100862
2021-848500,2021-01-21,000001,Vente,96300,,,LE HAMEL AUBRE,B378,50000,50502,Saint-Lô,50,,,505020000E0603,,,,,,,,,,,,,0,,,,,S,sols,,,60,-1.040555,49.101038
2021-848501,2021-01-22,000001,Vente,207000,61,,RUE LEOPOLD SEDAR SENGHOR,1687,50000,50502,Saint-Lô,50,,,50502000CR0287,,,,,,,,,,,,,0,1,Maison,108,4,S,sols,,,899,-1.076949,49.107374
2021-848511,2021-01-20,000001,Vente,138000,144,,RTE DES MONTS DE LA HEUTIERE,1912,50000,50502,Saint-Lô,50,,,505020000H0866,,,,,,,,,,,,,0,1,Maison,84,4,S,sols,,,1035,-1.060082,49.096614
2021-848511,2021-01-20,000001,Vente,138000,144,,RTE DES MONTS DE LA HEUTIERE,1912,50000,50502,Saint-Lô,50,,,505020000H0866,,,,,,,,,,,,,0,1,Maison,84,4,P,prés,,,1321,-1.060082,49.096614
2021-848526,2021-01-29,000001,Vente,190000,255,,RUE DU ROSSIGNOL,2510,50000,50502,Saint-Lô,50,,,50502000AN0277,,,,,,,,,,,,,0,1,Maison,136,3,S,sols,,,527,-1.080881,49.113631
2021-848526,2021-01-29,000001,Vente,190000,,,RUE MAL DE LATTRE DE TASSIGNY,1781,50000,50502,Saint-Lô,50,,,50502000AN0284,,,,,,,,,,,,,0,,,,,S,sols,,,91,-1.080939,49.113524
2021-848535,2021-02-04,000001,Vente,76000,46,,RUE DE LA ROQUETTE,2507,50000,50502,Saint-Lô,50,,,50502000AH0107,,,,,,,,,,,,,0,1,Maison,50,2,S,sols,,,111,-1.085164,49.120882
2021-848554,2021-02-22,000001,Vente,74000,90,,RUE SAMUEL BECKETT,2592,50000,50502,Saint-Lô,50,,,50502000CI0001,,,162,,,,,,,,,,1,3,Dépendance,,0,,,,,,-1.103378,49.1039
2021-848554,2021-02-22,000001,Vente,74000,90,,RUE SAMUEL BECKETT,2592,50000,50502,Saint-Lô,50,,,50502000CI0001,,,19,38.65,,,,,,,,,1,2,Appartement,38,2,,,,,,-1.103378,49.1039
2021-848557,2021-02-12,000001,Vente,155700,177,,RUE DES TROENES,2715,50000,50502,Saint-Lô,50,,,50502000CX0082,,,,,,,,,,,,,0,1,Maison,95,6,S,sols,,,245,-1.063592,49.113706
2021-848558,2021-02-23,000001,Vente,401000,159,,RUE DES CINQ CHEMINS,0637,50000,50502,Saint-Lô,50,,,50502000CN0131,,,,,,,,,,,,,0,1,Maison,132,6,AG,terrains d'agrément,,,2521,-1.078334,49.099306
2021-848558,2021-02-23,000001,Vente,401000,159,,RUE DES CINQ CHEMINS,0637,50000,50502,Saint-Lô,50,,,50502000CN0131,,,,,,,,,,,,,0,1,Maison,132,6,S,sols,,,1601,-1.078334,49.099306
2021-848559,2021-01-30,000001,Vente,255000,262,,RUE DU BOIS ARDENT,0269,50000,50502,Saint-Lô,50,,,50502000CO0171,,,,,,,,,,,,,0,1,Maison,137,5,S,sols,,,505,-1.082902,49.105549
2021-848560,2021-02-19,000001,Vente,9200,,,LE HAUT DU PRE DE DAYE,B384,50000,50502,Saint-Lô,50,,,505020000D0572,,,,,,,,,,,,,0,,,,,BP,peupleraies,,,3700,-1.060699,49.124071
2021-848560,2021-02-19,000001,Vente,9200,,,LE HAUT DU PRE DE DAYE,B384,50000,50502,Saint-Lô,50,,,505020000D0573,,,,,,,,,,,,,0,,,,,BP,peupleraies,,,1330,-1.060977,49.124217
2021-848560,2021-02-19,000001,Vente,9200,,,LE HAUT DU PRE DE DAYE,B384,50000,50502,Saint-Lô,50,,,505020000D0576,,,,,,,,,,,,,0,,,,,BP,peupleraies,,,1700,-1.060517,49.12481
2021-848560,2021-02-19,000001,Vente,9200,,,LE HAUT DU PRE DE DAYE,B384,50000,50502,Saint-Lô,50,,,505020000D0577,,,,,,,,,,,,,0,,,,,BP,peupleraies,,,4166,-1.060044,49.124621
2021-848560,2021-02-19,000001,Vente,9200,,,LE PRE DE LA MEAUFFE,B926,50000,50502,Saint-Lô,50,,,505020000D0578,,,,,,,,,,,,,0,,,,,BP,peupleraies,,,2551,-1.059742,49.125199
2021-848560,2021-02-19,000001,Vente,9200,,,LE PRE DE LA MEAUFFE,B926,50000,50502,Saint-Lô,50,,,505020000D0579,,,,,,,,,,,,,0,,,,,BP,peupleraies,,,1525,-1.059829,49.125531
2021-848562,2021-02-18,000001,Vente,183900,78,,RUE JEAN DE BREBEUF,0348,50000,50502,Saint-Lô,50,,,50502000CL0274,,,,,,,,,,,,,0,1,Maison,88,5,S,sols,,,715,-1.090669,49.102254
2021-848563,2021-02-17,000001,Vente terrain à bâtir,42500,,,LE CLOS CAUVIN,B161,50000,50502,Saint-Lô,50,,,50502000CL0385,,,,,,,,,,,,,0,,,,,AB,terrains a bâtir,,,390,-1.093222,49.102316
2021-848565,2021-02-12,000001,Vente,49000,4,B,RUE DE LA FONTAINE VENISE,1030,50000,50502,Saint-Lô,50,,,50502000AP0445,,,33,24.72,,,,,,,,,1,2,Appartement,25,1,,,,,,-1.088749,49.112726
2021-848565,2021-02-12,000001,Vente,49000,4,B,RUE DE LA FONTAINE VENISE,1030,50000,50502,Saint-Lô,50,,,50502000AP0445,,,95,,,,,,,,,,1,3,Dépendance,,0,,,,,,-1.088749,49.112726
2021-848565,2021-02-12,000001,Vente,49000,4,B,RUE DE LA FONTAINE VENISE,1030,50000,50502,Saint-Lô,50,,,50502000AP0446,,,,,,,,,,,,,0,,,,,S,sols,,,8,-1.088702,49.11286
2021-848565,2021-02-12,000001,Vente,49000,4,B,RUE DE LA FONTAINE VENISE,1030,50000,50502,Saint-Lô,50,,,50502000AP0447,,,,,,,,,,,,,0,,,,,S,sols,,,214,-1.088932,49.112889
2021-848565,2021-02-12,000001,Vente,49000,,,RUE DE LA MARNE,1800,50000,50502,Saint-Lô,50,,,50502000AP0450,,,,,,,,,,,,,0,,,,,S,sols,,,77,-1.088574,49.112845
2021-848565,2021-02-12,000001,Vente,49000,,,RUE DE LA MARNE,1800,50000,50502,Saint-Lô,50,,,50502000AP0452,,,,,,,,,,,,,0,,,,,S,sols,,,14,-1.088413,49.112922
2021-848565,2021-02-12,000001,Vente,49000,4,B,RUE DE LA FONTAINE VENISE,1030,50000,50502,Saint-Lô,50,,,50502000AP0454,,,,,,,,,,,,,0,,,,,S,sols,,,136,-1.088395,49.112869
2021-848565,2021-02-12,000001,Vente,49000,,,RUE DE LA FONTAINE VENISE,1030,50000,50502,Saint-Lô,50,,,50502000AP0458,,,,,,,,,,,,,0,,,,,S,sols,,,432,-1.088073,49.112669
2021-848576,2021-02-01,000001,Vente,28000,,,LE FRUITIER,B287,50000,50502,Saint-Lô,50,,,50502000CI0195,,,,,,,,,,,,,0,,,,,AB,terrains a bâtir,,,257,-1.099995,49.106316
2021-848577,2021-02-11,000001,Vente,44000,,,LE FRUITIER,B287,50000,50502,Saint-Lô,50,,,50502000CI0188,,,,,,,,,,,,,0,,,,,AB,terrains a bâtir,,,422,-1.098976,49.106883
2021-848578,2021-02-24,000001,Vente,42500,,,LE FRUITIER,B287,50000,50502,Saint-Lô,50,,,50502000CI0205,,,,,,,,,,,,,0,,,,,AB,terrains a bâtir,,,403,-1.099228,49.106201
2021-848579,2021-02-18,000001,Vente,34500,,,LE FRUITIER,B287,50000,50502,Saint-Lô,50,,,50502000CI0187,,,,,,,,,,,,,0,,,,,AB,terrains a bâtir,,,333,-1.098931,49.107165
2021-848580,2021-02-16,000001,Vente,46000,,,LE FRUITIER,B287,50000,50502,Saint-Lô,50,,,50502000CI0212,,,,,,,,,,,,,0,,,,,AB,terrains a bâtir,,,445,-1.09971,49.105477
2021-848581,2021-02-24,000001,Vente,64000,,,LE FRUITIER,B287,50000,50502,Saint-Lô,50,,,50502000CI0210,,,,,,,,,,,,,0,,,,,AB,terrains a bâtir,,,650,-1.099872,49.105878
2021-848590,2021-02-19,000001,Vente,109000,2,T,RUE DES CABINES,0430,50000,50502,Saint-Lô,50,,,50502000AW0534,,,,,,,,,,,,,0,1,Maison,88,3,S,sols,,,1313,-1.105726,49.110749
2021-848596,2021-02-18,000001,Vente,78500,52,,PL DU CHAMP DE MARS,0570,50000,50502,Saint-Lô,50,,,50502000AO0045,,,22,98.91,,,,,,,,,1,2,Appartement,75,4,,,,,,-1.085633,49.117142
2021-848597,2021-02-12,000001,Vente,117377,90,,RUE DU NEUFBOURG,2010,50000,50502,Saint-Lô,50,,,50502000AO0362,,,2,76.4,8,,,,,,,,2,2,Appartement,77,4,,,,,,-1.084115,49.115488
2021-848601,2021-02-22,000001,Vente,160000,23,,RUE HENRI AMIARD,1340,50000,50502,Saint-Lô,50,,,50502000AV0086,,,2,,8,,,,,,,,2,2,Appartement,56,3,,,,,,-1.094654,49.115031
2021-848601,2021-02-22,000001,Vente,160000,9001,,RUE PORTE AU LAIT,2360,50000,50502,Saint-Lô,50,,,50502000AV0086,,,6,,,,,,,,,,1,3,Dépendance,,0,,,,,,-1.094654,49.115031
2021-848604,2021-02-22,000001,Vente,31500,18,,IMP DU GUET,1225,50000,50502,Saint-Lô,50,,,50502000CH0189,,,131,21.25,,,,,,,,,1,2,Appartement,21,1,,,,,,-1.092851,49.109269
2021-848605,2021-02-23,000001,Vente,125000,42,,RUE DES CIGOGNES,0634,50000,50502,Saint-Lô,50,,,50502000CV0053,,,,,,,,,,,,,0,1,Maison,55,4,S,sols,,,412,-1.062874,49.111361
2021-848614,2021-02-24,000001,Vente,5000,2,B,RUE DE LA MARNE,1800,50000,50502,Saint-Lô,50,,,50502000AP0427,,,97,,,,,,,,,,1,3,Dépendance,,0,,,,,,-1.089912,49.113196
2021-848615,2021-02-24,000001,Vente,4500,2,B,RUE DE LA MARNE,1800,50000,50502,Saint-Lô,50,,,50502000AP0427,,,85,,,,,,,,,,1,3,Dépendance,,0,,,,,,-1.089912,49.113196
2021-848629,2021-02-24,000001,Vente,43500,3,,RUE DU PAIN DE SEIGLE,2090,50000,50502,Saint-Lô,50,,,50502000AT0695,,,56,,,,,,,,,,1,3,Dépendance,,0,,,,,,-1.09224,49.112043
2021-848629,2021-02-24,000001,Vente,43500,3,,RUE DU PAIN DE SEIGLE,2090,50000,50502,Saint-Lô,50,,,50502000AT0695,,,14,19.6,45,,,,,,,,2,2,Appartement,19,1,,,,,,-1.09224,49.112043
2021-848631,2021-02-22,000001,Vente,89500,53,,PL JOSEPH GUISLE,1609,50000,50502,Saint-Lô,50,,,50502000CD0018,,,143,,96,87.87,,,,,,,2,2,Appartement,89,4,,,,,,-1.105042,49.108515
2021-848631,2021-02-22,000001,Vente,89500,9017,,PL JOSEPH GUISLE,1609,50000,50502,Saint-Lô,50,,,50502000CD0037,,,,,,,,,,,,,0,3,Dépendance,,0,S,sols,,,18,-1.104783,49.108643
2021-848636,2021-02-19,000001,Vente,220000,127,,AV DE PARIS,2120,50000,50502,Saint-Lô,50,,,50502000AK0037,,,,,,,,,,,,,0,1,Maison,114,5,S,sols,,,265,-1.073289,49.116001
2021-848642,2021-03-08,000001,Vente,200000,,,IMP DE L ETANG,0958,50000,50502,Saint-Lô,50,,,50502000CT0084,,,,,,,,,,,,,0,,,,,S,sols,,,679,-1.070613,49.108305
2021-848642,2021-03-08,000001,Vente,200000,,,IMP DU FRUITIER,1075,50000,50502,Saint-Lô,50,,,50502000CT0102,,,,,,,,,,,,,0,,,,,S,sols,,,527,-1.068785,49.107142
2021-848642,2021-03-08,000001,Vente,200000,,,IMP DU PIGEONNIER,2244,50000,50502,Saint-Lô,50,,,50502000CT0121,,,,,,,,,,,,,0,,,,,S,sols,,,498,-1.066248,49.107571
2021-848642,2021-03-08,000001,Vente,200000,728,,RUE DE LA TRAPINIERE,2699,50000,50502,Saint-Lô,50,,,50502000CT0137,,,,,,,,,,,,,0,1,Maison,119,6,S,sols,,,345,-1.068856,49.108583
2021-848644,2021-03-09,000001,Vente,190000,9001,,LES BOTTEAUX,B050,50000,50502,Saint-Lô,50,,,505020000D1210,,,,,,,,,,,,,0,1,Maison,140,5,PH,herbages,,,1811,-1.045471,49.130115
2021-848644,2021-03-09,000001,Vente,190000,9001,,LES BOTTEAUX,B050,50000,50502,Saint-Lô,50,,,505020000D1210,,,,,,,,,,,,,0,1,Maison,140,5,S,sols,,,1100,-1.045471,49.130115
2021-848651,2021-03-09,000001,Vente,35000,9350,,IMP DU GUET,1225,50000,50502,Saint-Lô,50,,,50502000CH0191,,,28,,,,,,,,,,1,3,Dépendance,,0,,,,,,-1.092577,49.108946
2021-848651,2021-03-09,000001,Vente,35000,56,,IMP DU GUET,1225,50000,50502,Saint-Lô,50,,,50502000CH0191,,,12,21.01,,,,,,,,,1,2,Appartement,21,1,,,,,,-1.092577,49.108946
2021-848657,2021-02-23,000001,Vente,76300,15,,RUE HAUTE RUE,1310,50000,50502,Saint-Lô,50,,,50502000AT0235,,,,,,,,,,,,,0,1,Maison,85,4,S,sols,,,181,-1.093948,49.111161
2021-848668,2021-03-03,000001,Vente,41500,3,,RUE DU PAIN DE SEIGLE,2090,50000,50502,Saint-Lô,50,,,50502000AT0695,,,48,,,,,,,,,,1,3,Dépendance,,0,,,,,,-1.09224,49.112043
2021-848668,2021-03-03,000001,Vente,41500,3,,RUE DU PAIN DE SEIGLE,2090,50000,50502,Saint-Lô,50,,,50502000AT0695,,,7,19.44,,,,,,,,,1,2,Appartement,19,1,,,,,,-1.09224,49.112043
2021-848681,2021-03-12,000001,Vente,35500,25,,RUE DU BELLE,0220,50000,50502,Saint-Lô,50,,,50502000AV0009,,,1,,9,30.03,,,,,,,2,2,Appartement,31,1,,,,,,-1.094988,49.115833