id_mutation,date_mutation,numero_disposition,nature_mutation,valeur_fonciere,adresse_numero,adresse_suffixe,adresse_nom_voie,adresse_code_voie,code_postal,code_commune,nom_commune,code_departement,ancien_code_commune,ancien_nom_commune,id_parcelle,ancien_id_parcelle,numero_volume,lot1_numero,lot1_surface_carrez,lot2_numero,lot2_surface_carrez,lot3_numero,lot3_surface_carrez,lot4_numero,lot4_surface_carrez,lot5_numero,lot5_surface_carrez,nombre_lots,code_type_local,type_local,surface_reelle_bati,nombre_pieces_principales,code_nature_culture,nature_culture,code_nature_culture_speciale,nature_culture_speciale,surface_terrain,longitude,latitude
2021-856155,2021-07-16,000001,Vente,2000,,,LE CLOS DE BAS,B426,50630,50593,Teurthéville-Bocage,50,,,505930000A0982,,,,,,,,,,,,,0,,,,,P,prés,,,2835,-1.40658,49.58674
2021-856506,2021-07-08,000001,Vente,125000,24,,LE BOURG,B387,50630,50593,Teurthéville-Bocage,50,,,50593000AB0022,,,,,,,,,,,,,0,3,Dépendance,,0,S,sols,,,532,-1.395084,49.592649
2021-856506,2021-07-08,000001,Vente,125000,24,,LE BOURG,B387,50630,50593,Teurthéville-Bocage,50,,,50593000AB0022,,,,,,,,,,,,,0,2,Appartement,46,2,S,sols,,,532,-1.395084,49.592649
2021-856506,2021-07-08,000001,Vente,125000,24,,LE BOURG,B387,50630,50593,Teurthéville-Bocage,50,,,50593000AB0022,,,,,,,,,,,,,0,2,Appartement,46,2,S,sols,,,532,-1.395084,49.592649
2021-856506,2021-07-08,000001,Vente,125000,24,,LE BOURG,B387,50630,50593,Teurthéville-Bocage,50,,,50593000AB0022,,,,,,,,,,,,,0,3,Dépendance,,0,S,sols,,,532,-1.395084,49.592649
2021-856506,2021-07-08,000001,Vente,125000,24,,LE BOURG,B387,50630,50593,Teurthéville-Bocage,50,,,50593000AB0022,,,,,,,,,,,,,0,3,Dépendance,,0,S,sols,,,532,-1.395084,49.592649
2021-856506,2021-07-08,000001,Vente,125000,,,LE BOURG,B387,50630,50593,Teurthéville-Bocage,50,,,50593000AB0023,,,,,,,,,,,,,0,,,,,P,prés,,,577,-1.394907,49.592689
2021-856569,2021-07-05,000001,Vente,20000,,,HAMEAU ES QUESNEES,B808,50630,50593,Teurthéville-Bocage,50,,,505930000B0381,,,,,,,,,,,,,0,,,,,S,sols,,,78,-1.381163,49.603118
2021-856569,2021-07-05,000001,Vente,20000,,,HAMEAU ES QUESNEES,B808,50630,50593,Teurthéville-Bocage,50,,,505930000B0382,,,,,,,,,,,,,0,,,,,J,jardins,,,155,-1.381101,49.603206
2021-856569,2021-07-05,000001,Vente,20000,3,,HAMEAU CERTAIN,B809,50630,50593,Teurthéville-Bocage,50,,,505930000B0384,,,,,,,,,,,,,0,3,Dépendance,,0,S,sols,,,235,-1.380739,49.603277
2021-856569,2021-07-05,000001,Vente,20000,,,HAMEAU ES QUESNEES,B808,50630,50593,Teurthéville-Bocage,50,,,505930000B0385,,,,,,,,,,,,,0,,,,,S,sols,,,22,-1.380646,49.603112
2021-856569,2021-07-05,000001,Vente,20000,,,LE CLOS DE BAS,B426,50630,50593,Teurthéville-Bocage,50,,,505930000B0386,,,,,,,,,,,,,0,,,,,P,prés,,,2004,-1.380496,49.603195
2021-856569,2021-07-05,000001,Vente,20000,,,LE CLOS DE BAS,B426,50630,50593,Teurthéville-Bocage,50,,,505930000B0387,,,,,,,,,,,,,0,,,,,P,prés,,,598,-1.380447,49.603466
2021-856599,2021-07-16,000001,Vente,85000,2,,CARREFOUR SAINTE CROIX,B393,50630,50593,Teurthéville-Bocage,50,,,505930000A1016,,,,,,,,,,,,,0,3,Dépendance,,0,S,sols,,,915,-1.416661,49.581856
2021-856599,2021-07-16,000001,Vente,85000,2,,CARREFOUR SAINTE CROIX,B393,50630,50593,Teurthéville-Bocage,50,,,505930000A1016,,,,,,,,,,,,,0,1,Maison,134,5,S,sols,,,915,-1.416661,49.581856
2021-856700,2021-07-30,000001,Vente,17600,,,LA BONNEE,B073,50630,50593,Teurthéville-Bocage,50,,,505930000C0102,,,,,,,,,,,,,0,,,,,P,prés,,,7290,-1.356752,49.597572
2021-856700,2021-07-30,000001,Vente,17600,,,LE CLOS GROULT,B587,50630,50593,Teurthéville-Bocage,50,,,505930000C0105,,,,,,,,,,,,,0,,,,,P,prés,,,9830,-1.355275,49.597144
2021-856700,2021-07-30,000001,Vente,17600,,,LA FIEFFE,B153,50630,50593,Teurthéville-Bocage,50,,,505930000C0421,,,,,,,,,,,,,0,,,,,P,prés,,,4850,-1.35239,49.583628
2021-856954,2021-08-11,000001,Vente,5200,,,LA VALLEE,B345,50630,50593,Teurthéville-Bocage,50,,,505930000C0566,,,,,,,,,,,,,0,,,,,P,prés,,,4905,-1.369015,49.588324
2021-856954,2021-08-11,000001,Vente,5200,,,LA VALLEE,B345,50630,50593,Teurthéville-Bocage,50,,,505930000C0566,,,,,,,,,,,,,0,,,,,P,prés,,,1635,-1.369015,49.588324
2021-857446,2021-08-04,000001,Vente,4500,,,LE COIGNET,B716,50630,50593,Teurthéville-Bocage,50,,,505930000D0331,,,,,,,,,,,,,0,,,,,P,prés,,,6602,-1.388257,49.576552
2021-857519,2021-08-04,000001,Vente,16500,,,LA PIECE AUX MOINES,B298,50630,50593,Teurthéville-Bocage,50,,,505930000C0461,,,,,,,,,,,,,0,,,,,P,prés,,,7080,-1.367138,49.578519
2021-857586,2021-08-25,000001,Vente,2500,,,LA CROIX THOMASSE,B133,50630,50593,Teurthéville-Bocage,50,,,505930000D0742,,,,,,,,,,,,,0,,,,,P,prés,,,6310,-1.40611,49.583386
2021-857629,2021-08-23,000001,Vente,20000,,,LA VALLEE,B345,50630,50593,Teurthéville-Bocage,50,,,505930000D0298,,,,,,,,,,,,,0,,,,,P,prés,,,14630,-1.391356,49.574479
2021-857629,2021-08-23,000001,Vente,20000,,,LE CLOS JEAN,B659,50630,50593,Teurthéville-Bocage,50,,,505930000D0307,,,,,,,,,,,,,0,,,,,P,prés,,,12510,-1.389825,49.575312
2021-857629,2021-08-23,000001,Vente,20000,,,LA PAUSSERIE,B265,50630,50593,Teurthéville-Bocage,50,,,505930000D0308,,,,,,,,,,,,,0,,,,,P,prés,,,7831,-1.39063,49.574889
2021-858081,2021-08-16,000001,Vente,2000,,,LE PRE DE LA FAUVILLE,B993,50630,50593,Teurthéville-Bocage,50,,,505930000A0674,,,,,,,,,,,,,0,,,,,P,prés,,,3590,-1.40579,49.594609
2021-858219,2021-08-23,000001,Vente,205000,20,,LA CLERAUDERIE,B108,50630,50593,Teurthéville-Bocage,50,,,505930000A0885,,,,,,,,,,,,,0,3,Dépendance,,0,S,sols,,,660,-1.408369,49.596195
2021-858219,2021-08-23,000001,Vente,205000,20,,LA CLERAUDERIE,B108,50630,50593,Teurthéville-Bocage,50,,,505930000A0885,,,,,,,,,,,,,0,1,Maison,103,3,S,sols,,,660,-1.408369,49.596195
2021-858219,2021-08-23,000001,Vente,205000,20,,LA CLERAUDERIE,B108,50630,50593,Teurthéville-Bocage,50,,,505930000A0885,,,,,,,,,,,,,0,3,Dépendance,,0,S,sols,,,660,-1.408369,49.596195
2021-858219,2021-08-23,000001,Vente,205000,20,,LA CLERAUDERIE,B108,50630,50593,Teurthéville-Bocage,50,,,505930000A0885,,,,,,,,,,,,,0,3,Dépendance,,0,S,sols,,,660,-1.408369,49.596195
2021-858219,2021-08-23,000001,Vente,205000,,,LES POINTES,C208,50630,50593,Teurthéville-Bocage,50,,,505930000A0886,,,,,,,,,,,,,0,,,,,P,prés,,,1565,-1.40884,49.596182
2021-858219,2021-08-23,000001,Vente,205000,,,LA FIEFFE DE BAS,B163,50630,50593,Teurthéville-Bocage,50,,,505930000A1207,,,,,,,,,,,,,0,,,,,S,sols,,,82,-1.408403,49.596342
2021-858823,2021-09-02,000001,Vente,2500,,,HAMEAU PICOT,B794,50630,50593,Teurthéville-Bocage,50,,,505930000A0158,,,,,,,,,,,,,0,,,,,S,sols,,,178,-1.41309,49.609342
2021-858823,2021-09-02,000001,Vente,2500,,,LA MENAGERE,B255,50630,50593,Teurthéville-Bocage,50,,,505930000A0159,,,,,,,,,,,,,0,,,,,P,prés,,,4447,-1.412853,49.609637
2021-858823,2021-09-02,000001,Vente,2500,,,HAMEAU PICOT,B794,50630,50593,Teurthéville-Bocage,50,,,505930000A1162,,,,,,,,,,,,,0,,,,,P,prés,,,1141,-1.413237,49.610015
2021-859564,2021-09-30,000001,Vente,60000,,,ERRE SECHE,B021,50630,50593,Teurthéville-Bocage,50,,,505930000A0547,,,,,,,,,,,,,0,,,,,E,eaux,MARE,Mare,408,-1.394359,49.595894
2021-859564,2021-09-30,000001,Vente,60000,,,ERRE SECHE,B021,50630,50593,Teurthéville-Bocage,50,,,505930000A0547,,,,,,,,,,,,,0,,,,,P,prés,,,8893,-1.394359,49.595894
2021-859564,2021-09-30,000001,Vente,60000,,,ERRE SECHE,B021,50630,50593,Teurthéville-Bocage,50,,,505930000A0547,,,,,,,,,,,,,0,,,,,E,eaux,MARE,Mare,453,-1.394359,49.595894
2021-859564,2021-09-30,000001,Vente,60000,,,LA FRIGOTTERIE,B183,50630,50593,Teurthéville-Bocage,50,,,505930000A0548,,,,,,,,,,,,,0,,,,,P,prés,,,705,-1.393749,49.595559
2021-859564,2021-09-30,000001,Vente,60000,7,,LA FRIGOTTERIE,B183,50630,50593,Teurthéville-Bocage,50,,,505930000A0549,,,,,,,,,,,,,0,1,Maison,75,3,S,sols,,,810,-1.39363,49.595451
2021-860103,2021-09-30,000001,Vente,175000,42,,LE BOURG,B387,50630,50593,Teurthéville-Bocage,50,,,505930000A1138,,,,,,,,,,,,,0,1,Maison,94,5,S,sols,,,718,-1.395279,49.593204
2021-860103,2021-09-30,000001,Vente,175000,42,,LE BOURG,B387,50630,50593,Teurthéville-Bocage,50,,,505930000A1138,,,,,,,,,,,,,0,1,Maison,94,5,J,jardins,,,1337,-1.395279,49.593204
2021-861034,2021-10-28,000001,Vente,51000,80,,LE BOURG,B387,50630,50593,Teurthéville-Bocage,50,,,50593000AB0070,,,,,,,,,,,,,0,3,Dépendance,,0,S,sols,,,52,-1.398612,49.590787
2021-861034,2021-10-28,000001,Vente,51000,,,LE BOURG,B387,50630,50593,Teurthéville-Bocage,50,,,50593000AB0074,,,,,,,,,,,,,0,,,,,J,jardins,,,382,-1.398945,49.59138
2021-861034,2021-10-28,000001,Vente,51000,72,A,LE BOURG,B387,50630,50593,Teurthéville-Bocage,50,,,50593000AB0083,,,,,,,,,,,,,0,3,Dépendance,,0,S,sols,,,93,-1.397919,49.591207
2021-861034,2021-10-28,000001,Vente,51000,72,,LE BOURG,B387,50630,50593,Teurthéville-Bocage,50,,,50593000AB0084,,,,,,,,,,,,,0,1,Maison,41,2,S,sols,,,87,-1.397801,49.591289
2021-861111,2021-11-08,000001,Vente,5000,,,LE PRE MILET,B981,50630,50593,Teurthéville-Bocage,50,,,505930000A0030,,,,,,,,,,,,,0,,,,,P,prés,,,4150,-1.412539,49.610966
2021-861111,2021-11-08,000001,Vente,5000,,,LE PRE MILET,B981,50630,50593,Teurthéville-Bocage,50,,,505930000A0033,,,,,,,,,,,,,0,,,,,P,prés,,,12294,-1.411521,49.610905
2021-863276,2021-12-30,000001,Vente,4000,,,LE VIVIER LOUISE,C105,50630,50593,Teurthéville-Bocage,50,,,505930000A0303,,,,,,,,,,,,,0,,,,,P,prés,,,5650,-1.421532,49.607861
2021-863278,2021-12-27,000001,Vente,7000,,,LA VENTE SOLEIL,B362,50630,50593,Teurthéville-Bocage,50,,,505930000A0375,,,,,,,,,,,,,0,,,,,P,prés,,,10700,-1.429946,49.601539
2021-863450,2021-12-14,000001,Vente,4000,,,LES MONTREUILS,C195,50630,50593,Teurthéville-Bocage,50,,,505930000D0692,,,,,,,,,,,,,0,,,,,P,prés,,,8677,-1.390271,49.583337
2021-864184,2021-01-18,000001,Vente,50000,,,LE CLOS DE FONTAINE,B434,50630,50593,Teurthéville-Bocage,50,,,505930000A0441,,,,,,,,,,,,,0,,,,,P,prés,,,28790,-1.434666,49.598609
2021-864184,2021-01-18,000001,Vente,50000,,,LE PETIT PRE,B930,50630,50593,Teurthéville-Bocage,50,,,505930000A0442,,,,,,,,,,,,,0,,,,,P,prés,,,8765,-1.435693,49.599379
2021-864184,2021-01-18,000001,Vente,50000,,,LA FIQUETTERIE DE BAS,B174,50630,50593,Teurthéville-Bocage,50,,,505930000A0458,,,,,,,,,,,,,0,,,,,P,prés,,,18730,-1.436762,49.599165
2021-864184,2021-01-18,000001,Vente,50000,,,LA FIQUETTERIE DE HAUT,B175,50630,50593,Teurthéville-Bocage,50,,,505930000A0459,,,,,,,,,,,,,0,,,,,P,prés,,,7710,-1.438201,49.59825
2021-864184,2021-01-18,000001,Vente,50000,,,LA GRANDE FIQUETTERIE,B196,50630,50593,Teurthéville-Bocage,50,,,505930000A0461,,,,,,,,,,,,,0,,,,,P,prés,,,10190,-1.439147,49.598993
2021-864184,2021-01-18,000001,Vente,50000,,,L AVENUE DE LA FORET,B037,50630,50593,Teurthéville-Bocage,50,,,505930000A1071,,,,,,,,,,,,,0,,,,,L,landes,,,275,-1.439786,49.599193
2021-864253,2021-01-16,000001,Vente,2000,,,LE GRAND JARDIN,B746,50630,50593,Teurthéville-Bocage,50,,,505930000A0095,,,,,,,,,,,,,0,,,,,P,prés,,,1086,-1.405462,49.608995
2021-864253,2021-01-16,000001,Vente,2000,,,HAMEAU BOURDET,B793,50630,50593,Teurthéville-Bocage,50,,,505930000A1078,,,,,,,,,,,,,0,,,,,P,prés,,,57,-1.404323,49.608583
2021-864253,2021-01-16,000001,Vente,2000,,,LA VALLEE DE DERRIERE,B346,50630,50593,Teurthéville-Bocage,50,,,505930000A1081,,,,,,,,,,,,,0,,,,,P,prés,,,2482,-1.40465,49.609057
2021-864255,2021-01-14,000001,Vente,130000,8,,HAMEAU ES FOLLIOT,B804,50630,50593,Teurthéville-Bocage,50,,,505930000B0683,,,,,,,,,,,,,0,1,Maison,156,5,S,sols,,,965,-1.393032,49.605783
2021-864255,2021-01-14,000001,Vente,130000,,,HAMEAU ES FOLLIOT,B804,50630,50593,Teurthéville-Bocage,50,,,505930000B0684,,,,,,,,,,,,,0,,,,,S,sols,,,240,-1.393305,49.605759
2021-864366,2021-01-30,000001,Vente,135000,30,,LE BOURG,B387,50630,50593,Teurthéville-Bocage,50,,,50593000AB0014,,,,,,,,,,,,,0,1,Maison,70,3,S,sols,,,56,-1.395811,49.592399
2021-864366,2021-01-30,000001,Vente,135000,30,A,LE BOURG,B387,50630,50593,Teurthéville-Bocage,50,,,50593000AB0015,,,,,,,,,,,,,0,1,Maison,50,2,S,sols,,,559,-1.395908,49.592501
2021-864485,2021-03-17,000001,Vente,3000,,,LE MONTROTY,B907,50630,50593,Teurthéville-Bocage,50,,,505930000A0962,,,,,,,,,,,,,0,,,,,P,prés,,,4260,-1.412034,49.58779
2021-864489,2021-03-17,000001,Vente,8500,,,LA GRANDE JANNIERE,B198,50630,50593,Teurthéville-Bocage,50,,,505930000A0811,,,,,,,,,,,,,0,,,,,L,landes,,,2500,-1.410477,49.593987
2021-864489,2021-03-17,000001,Vente,8500,,,LA BANQUETTE,B060,50630,50593,Teurthéville-Bocage,50,,,505930000A0908,,,,,,,,,,,,,0,,,,,P,prés,,,3150,-1.42241,49.590292
2021-864489,2021-03-17,000001,Vente,8500,,,LE CLOS DU MILIEU,B414,50630,50593,Teurthéville-Bocage,50,,,505930000A0909,,,,,,,,,,,,,0,,,,,P,prés,,,8522,-1.422024,49.589721
2021-864531,2021-03-05,000001,Vente,65000,,,LE CHAMP DE VAUX DURAND,B400,50630,50593,Teurthéville-Bocage,50,,,505930000B0340,,,,,,,,,,,,,0,,,,,P,prés,,,8470,-1.38493,49.601416
2021-864531,2021-03-05,000001,Vente,65000,,,LES COUDRAIES,C129,50630,50593,Teurthéville-Bocage,50,,,505930000B0343,,,,,,,,,,,,,0,,,,,P,prés,,,4867,-1.383915,49.600722
2021-864531,2021-03-05,000001,Vente,65000,,,LE CHAMP DU MESNIL,B399,50630,50593,Teurthéville-Bocage,50,,,505930000B0344,,,,,,,,,,,,,0,,,,,P,prés,,,1067,-1.383715,49.601079
2021-864531,2021-03-05,000001,Vente,65000,,,LA HOUGUETTE,B234,50630,50593,Teurthéville-Bocage,50,,,505930000B0345,,,,,,,,,,,,,0,,,,,S,sols,,,65,-1.383691,49.600729
2021-864531,2021-03-05,000001,Vente,65000,1,,HAMEAU ES QUESNEES,B808,50630,50593,Teurthéville-Bocage,50,,,505930000B0346,,,,,,,,,,,,,0,1,Maison,110,2,S,sols,,,1067,-1.384024,49.600293
2021-864531,2021-03-05,000001,Vente,65000,,,LA JANNIERE,B239,50630,50593,Teurthéville-Bocage,50,,,505930000B0355,,,,,,,,,,,,,0,,,,,P,prés,,,3240,-1.380663,49.600745
2021-864531,2021-03-05,000001,Vente,65000,,,LA CAMPAGNE,B083,50630,50593,Teurthéville-Bocage,50,,,505930000B0447,,,,,,,,,,,,,0,,,,,P,prés,,,3835,-1.372152,49.602296
2021-864531,2021-03-05,000001,Vente,65000,,,LA CAMPAGNE,B083,50630,50593,Teurthéville-Bocage,50,,,505930000B0448,,,,,,,,,,,,,0,,,,,P,prés,,,5775,-1.372068,49.602677
2021-864531,2021-03-05,000001,Vente,65000,,,LES VERGEES,C239,50630,50593,Teurthéville-Bocage,50,,,505930000B0450,,,,,,,,,,,,,0,,,,,P,prés,,,6573,-1.373874,49.602419
2021-864531,2021-03-05,000001,Vente,65000,,,LE VAUGEARD,C096,50630,50593,Teurthéville-Bocage,50,,,505930000B0547,,,,,,,,,,,,,0,,,,,P,prés,,,3541,-1.38206,49.59943
2021-864531,2021-03-05,000001,Vente,65000,,,LE VAUGEARD,C096,50630,50593,Teurthéville-Bocage,50,,,505930000B0549,,,,,,,,,,,,,0,,,,,P,prés,,,2180,-1.382002,49.598707
2021-864581,2021-03-29,000001,Vente,6700,,,LE PETIT PRE,B930,50630,50593,Teurthéville-Bocage,50,,,505930000A0171,,,,,,,,,,,,,0,,,,,P,prés,,,2800,-1.440807,49.605193
2021-864581,2021-03-29,000001,Vente,6700,,,LA PETITE ORQUEUSE,B274,50630,50593,Teurthéville-Bocage,50,,,505930000A0213,,,,,,,,,,,,,0,,,,,P,prés,,,4810,-1.439827,49.603019
2021-864815,2021-05-11,000001,Vente,97500,,,LA CHASSE DU MARAIS,B101,50630,50593,Teurthéville-Bocage,50,,,505930000A0383,,,,,,,,,,,,,0,,,,,P,prés,,,3112,-1.429897,49.602734
2021-864815,2021-05-11,000001,Vente,97500,5,,HAMEAU GOUPIL,B796,50630,50593,Teurthéville-Bocage,50,,,505930000A0384,,,,,,,,,,,,,0,1,Maison,86,3,S,sols,,,368,-1.429816,49.603065
2021-864815,2021-05-11,000001,Vente,97500,,,HAMEAU GOUPIL,B796,50630,50593,Teurthéville-Bocage,50,,,505930000A0385,,,,,,,,,,,,,0,,,,,J,jardins,,,983,-1.429508,49.603031
2021-864815,2021-05-11,000001,Vente,97500,,,LA FIEFFE,B153,50630,50593,Teurthéville-Bocage,50,,,505930000A0386,,,,,,,,,,,,,0,,,,,P,prés,,,1453,-1.429258,49.603296
2021-864815,2021-05-11,000001,Vente,97500,,,HAMEAU GOUPIL,B796,50630,50593,Teurthéville-Bocage,50,,,505930000A0387,,,,,,,,,,,,,0,,,,,S,sols,,,233,-1.428939,49.603405
2021-864894,2021-05-03,000001,Vente,91000,,,SAINTE CROIX,C257,50630,50593,Teurthéville-Bocage,50,,,505930000D0769,,,,,,,,,,,,,0,,,,,S,sols,,,20,-1.408479,49.579641
2021-864894,2021-05-03,000001,Vente,91000,,,SAINTE CROIX,C257,50630,50593,Teurthéville-Bocage,50,,,505930000D0770,,,,,,,,,,,,,0,,,,,J,jardins,,,851,-1.408613,49.579627
2021-864894,2021-05-03,000001,Vente,91000,20,,SAINTE CROIX,C257,50630,50593,Teurthéville-Bocage,50,,,505930000D0771,,,,,,,,,,,,,0,1,Maison,95,4,S,sols,,,1506,-1.408913,49.579722
2021-864894,2021-05-03,000001,Vente,91000,20,,SAINTE CROIX,C257,50630,50593,Teurthéville-Bocage,50,,,505930000D0771,,,,,,,,,,,,,0,1,Maison,22,1,S,sols,,,1506,-1.408913,49.579722
