id_mutation,date_mutation,numero_disposition,nature_mutation,valeur_fonciere,adresse_numero,adresse_suffixe,adresse_nom_voie,adresse_code_voie,code_postal,code_commune,nom_commune,code_departement,ancien_code_commune,ancien_nom_commune,id_parcelle,ancien_id_parcelle,numero_volume,lot1_numero,lot1_surface_carrez,lot2_numero,lot2_surface_carrez,lot3_numero,lot3_surface_carrez,lot4_numero,lot4_surface_carrez,lot5_numero,lot5_surface_carrez,nombre_lots,code_type_local,type_local,surface_reelle_bati,nombre_pieces_principales,code_nature_culture,nature_culture,code_nature_culture_speciale,nature_culture_speciale,surface_terrain,longitude,latitude
2021-870338,2021-06-01,000002,Vente,144790.48,,,LE VILLAGE,B055,51260,51041,Baudement,51,,,510410000B0346,,,,,,,,,,,,,0,,,,,P,prés,,,3440,3.774086,48.574528
2021-870338,2021-06-01,000002,Vente,144790.48,,,LA PIECE DU MAITRE D ECOLE,B043,51260,51041,Baudement,51,,,51041000ZT0008,,,,,,,,,,,,,0,,,,,BT,taillis simples,,,820,3.77062,48.573614
2021-870338,2021-06-01,000002,Vente,144790.48,,,LE GUE DU SOIR,B028,51260,51041,Baudement,51,,,51041000ZV0002,,,,,,,,,,,,,0,,,,,BT,taillis simples,,,5500,3.776064,48.572282
2021-870338,2021-06-01,000002,Vente,144790.48,,,LE GUE DU SOIR,B028,51260,51041,Baudement,51,,,51041000ZV0002,,,,,,,,,,,,,0,,,,,T,terres,,,37235,3.776064,48.572282
2021-870338,2021-06-01,000002,Vente,144790.48,,,LE GUE DU SOIR,B028,51260,51041,Baudement,51,,,51041000ZV0002,,,,,,,,,,,,,0,,,,,T,terres,,,25000,3.776064,48.572282
2021-870338,2021-06-01,000002,Vente,144790.48,,,LE PRE DE L AUNE,B045,51260,51041,Baudement,51,,,51041000ZV0025,,,,,,,,,,,,,0,,,,,T,terres,,,2744,3.782061,48.571457
2021-875665,2021-09-20,000002,Vente,110000,2,,RUE DE L'EGLISE,0050,51260,51041,Baudement,51,,,510410000B0452,,,,,,,,,,,,,0,3,Dépendance,,0,,,,,,3.775311,48.575014
2021-875665,2021-09-20,000002,Vente,110000,2,,RUE DE L'EGLISE,0050,51260,51041,Baudement,51,,,510410000B0452,,,,,,,,,,,,,0,3,Dépendance,,0,,,,,,3.775311,48.575014
2021-875665,2021-09-20,000002,Vente,110000,2,,RUE DE L'EGLISE,0050,51260,51041,Baudement,51,,,510410000B0452,,,,,,,,,,,,,0,1,Maison,248,8,,,,,,3.775311,48.575014
