id_mutation,date_mutation,numero_disposition,nature_mutation,valeur_fonciere,adresse_numero,adresse_suffixe,adresse_nom_voie,adresse_code_voie,code_postal,code_commune,nom_commune,code_departement,ancien_code_commune,ancien_nom_commune,id_parcelle,ancien_id_parcelle,numero_volume,lot1_numero,lot1_surface_carrez,lot2_numero,lot2_surface_carrez,lot3_numero,lot3_surface_carrez,lot4_numero,lot4_surface_carrez,lot5_numero,lot5_surface_carrez,nombre_lots,code_type_local,type_local,surface_reelle_bati,nombre_pieces_principales,code_nature_culture,nature_culture,code_nature_culture_speciale,nature_culture_speciale,surface_terrain,longitude,latitude
2021-868309,2021-04-19,000001,Vente,750000,,,LE COTON,B004,51340,51068,Blesme,51,,,510680000B0093,,,,,,,,,,,,,0,,,,,BT,taillis simples,,,3662,4.809133,48.734185
2021-869269,2021-05-06,000001,Vente,5000,,,LE PAQUIS,B024,51340,51068,Blesme,51,,,510680000X0090,,,,,,,,,,,,,0,,,,,BP,peupleraies,,,3101,4.772065,48.721807
2021-870317,2021-05-28,000001,Vente,164000,4,B,RUE DES TILLEULS,0080,51340,51068,Blesme,51,,,51068000AC0287,,,,,,,,,,,,,0,1,Maison,104,5,S,sols,,,188,4.776539,48.724625
2021-870317,2021-05-28,000001,Vente,164000,,,LE VIVIER,B041,51340,51068,Blesme,51,,,51068000AC0289,,,,,,,,,,,,,0,,,,,S,sols,,,692,4.7766,48.724699
2021-874023,2021-08-04,000001,Echange,4400,,,LA CROIX FAUCHOT,B005,51340,51068,Blesme,51,,,510680000B0162,,,,,,,,,,,,,0,,,,,BS,taillis sous futaie,,,3930,4.821679,48.733625
2021-874023,2021-08-04,000001,Echange,4400,,,LA CROIX FAUCHOT,B005,51340,51068,Blesme,51,,,510680000B0163,,,,,,,,,,,,,0,,,,,BS,taillis sous futaie,,,7810,4.822163,48.734274
2021-874136,2021-09-01,000001,Vente,110000,9,,RUE DE SAINT LUMIER,0070,51340,51068,Blesme,51,,,51068000AC0266,,,,,,,,,,,,,0,1,Maison,148,6,S,sols,,,157,4.77759,48.726056
2021-874136,2021-09-01,000001,Vente,110000,9,,RUE DE SAINT LUMIER,0070,51340,51068,Blesme,51,,,51068000AC0266,,,,,,,,,,,,,0,3,Dépendance,,0,S,sols,,,157,4.77759,48.726056
2021-874136,2021-09-01,000001,Vente,110000,11,,RUE DE SAINT LUMIER,0070,51340,51068,Blesme,51,,,51068000AC0268,,,,,,,,,,,,,0,,,,,S,sols,,,56,4.777637,48.72599
2021-874136,2021-09-01,000001,Vente,110000,,,LE VILLAGE,B040,51340,51068,Blesme,51,,,51068000AC0276,,,,,,,,,,,,,0,,,,,S,sols,,,201,4.777502,48.726057
2021-875646,2021-09-21,000001,Vente,2600,5002,,LA PLANCHETTE,B031,51340,51068,Blesme,51,,,51068000ZE0013,,,,,,,,,,,,,0,1,Maison,48,1,S,sols,,,1000,4.77466,48.732697
2021-877647,2021-11-17,000001,Vente,89000,8,,RUE DE SAINT LUMIER,0070,51340,51068,Blesme,51,,,51068000AC0064,,,,,,,,,,,,,0,1,Maison,67,3,S,sols,,,578,4.778617,48.725671
2021-879267,2021-12-23,000001,Vente,14000,,,LE MOULIN,B023,51340,51068,Blesme,51,,,51068000AC0297,,,,,,,,,,,,,0,,,,,BP,peupleraies,,,746,4.769635,48.724097
2021-879267,2021-12-23,000001,Vente,14000,,,LE MOULIN,B023,51340,51068,Blesme,51,,,51068000AC0299,,,,,,,,,,,,,0,,,,,T,terres,,,405,4.769835,48.724051
