id_mutation,date_mutation,numero_disposition,nature_mutation,valeur_fonciere,adresse_numero,adresse_suffixe,adresse_nom_voie,adresse_code_voie,code_postal,code_commune,nom_commune,code_departement,ancien_code_commune,ancien_nom_commune,id_parcelle,ancien_id_parcelle,numero_volume,lot1_numero,lot1_surface_carrez,lot2_numero,lot2_surface_carrez,lot3_numero,lot3_surface_carrez,lot4_numero,lot4_surface_carrez,lot5_numero,lot5_surface_carrez,nombre_lots,code_type_local,type_local,surface_reelle_bati,nombre_pieces_principales,code_nature_culture,nature_culture,code_nature_culture_speciale,nature_culture_speciale,surface_terrain,longitude,latitude
2021-865420,2021-01-20,000001,Vente,370000,1,,MOULIN D'HOYAU,B027,51170,51111,Chambrecy,51,,,51111000ZH0035,,,,,,,,,,,,,0,1,Maison,108,6,J,jardins,,,4360,3.830407,49.179422
2021-865420,2021-01-20,000001,Vente,370000,1,,MOULIN D'HOYAU,B027,51170,51111,Chambrecy,51,,,51111000ZH0035,,,,,,,,,,,,,0,1,Maison,108,6,S,sols,,,3200,3.830407,49.179422
2021-865420,2021-01-20,000001,Vente,370000,1,,MOULIN D'HOYAU,B027,51170,51111,Chambrecy,51,,,51111000ZH0035,,,,,,,,,,,,,0,1,Maison,108,6,L,landes,FRICH,Friche,11036,3.830407,49.179422
2021-865420,2021-01-20,000001,Vente,370000,,,LES MARAIS,B018,51170,51111,Chambrecy,51,,,51111000ZH0036,,,,,,,,,,,,,0,,,,,L,landes,FRICH,Friche,182,3.829679,49.180048
2021-867203,2021-03-05,000001,Vente,3000,,,LA PALETTE,B023,51170,51111,Chambrecy,51,,,51111000ZD0033,,,,,,,,,,,,,0,,,,,J,jardins,,,1299,3.818598,49.181413
2021-868988,2021-04-19,000001,Vente,324000,7,,RUE DES MARAIS,0025,51170,51111,Chambrecy,51,,,511110000B0960,,,,,,,,,,,,,0,4,Local industriel. commercial ou assimilé,17,0,S,sols,,,769,3.823453,49.181901
2021-868988,2021-04-19,000001,Vente,324000,7,,RUE DES MARAIS,0025,51170,51111,Chambrecy,51,,,511110000B0960,,,,,,,,,,,,,0,1,Maison,180,8,S,sols,,,769,3.823453,49.181901
2021-869220,2021-04-24,000001,Vente,14000,,,LA PALETTE,B023,51170,51111,Chambrecy,51,,,51111000ZD0046,,,,,,,,,,,,,0,,,,,J,jardins,,,3577,3.818959,49.182595
2021-870524,2021-05-14,000001,Vente,80000,4,,RUE ST JULIEN,0030,51170,51111,Chambrecy,51,,,511110000B0197,,,2,,,,,,,,,,1,3,Dépendance,,0,,,,,,3.82193,49.183194
2021-870524,2021-05-14,000001,Vente,80000,4,,RUE ST JULIEN,0030,51170,51111,Chambrecy,51,,,511110000B0197,,,2,,,,,,,,,,1,1,Maison,85,3,,,,,,3.82193,49.183194
2021-870524,2021-05-14,000001,Vente,80000,,,LE VILLAGE,B026,51170,51111,Chambrecy,51,,,511110000B0200,,,,,,,,,,,,,0,,,,,S,sols,,,180,3.821612,49.183105
2021-870524,2021-05-14,000001,Vente,80000,,,LE VILLAGE,B026,51170,51111,Chambrecy,51,,,511110000B0201,,,,,,,,,,,,,0,,,,,J,jardins,,,180,3.821479,49.183048
2021-870524,2021-05-14,000001,Vente,80000,,,LE VILLAGE,B026,51170,51111,Chambrecy,51,,,511110000B0205,,,,,,,,,,,,,0,,,,,J,jardins,,,135,3.821932,49.183059
2021-872133,2021-07-08,000001,Vente,278290,,,LES LOGES,B017,51170,51111,Chambrecy,51,,,511110000C1449,,,,,,,,,,,,,0,,,,,VI,vignes,VAOC,Vins d'appellation d'origine contrôlée,1985,3.837765,49.180516
2021-872133,2021-07-08,000001,Vente,278290,,,LES LOGES,B017,51170,51111,Chambrecy,51,,,511110000C1517,,,,,,,,,,,,,0,,,,,VI,vignes,VAOC,Vins d'appellation d'origine contrôlée,1289,3.837651,49.180668
2021-874036,2021-08-04,000001,Vente,17000,,,LA PALETTE,B023,51170,51111,Chambrecy,51,,,51111000ZD0042,,,,,,,,,,,,,0,,,,,J,jardins,,,2069,3.817575,49.182445
2021-874553,2021-09-01,000001,Vente,80000,,,AU DESSUS DES USAGES,B011,51170,51111,Chambrecy,51,,,51111000ZI0078,,,,,,,,,,,,,0,,,,,AB,terrains a bâtir,,,943,3.824208,49.181512
2021-874557,2021-09-01,000001,Vente,80000,,,AU DESSUS DES USAGES,B011,51170,51111,Chambrecy,51,,,51111000ZI0083,,,,,,,,,,,,,0,,,,,AB,terrains a bâtir,,,942,3.825647,49.181571
2021-875238,2021-09-15,000001,Vente,219200,2,,RUE ST JULIEN,0030,51170,51111,Chambrecy,51,,,511110000B0195,,,,,,,,,,,,,0,1,Maison,38,2,S,sols,,,518,3.821812,49.183435
2021-875238,2021-09-15,000001,Vente,219200,2,,RUE ST JULIEN,0030,51170,51111,Chambrecy,51,,,511110000B0195,,,,,,,,,,,,,0,1,Maison,179,8,S,sols,,,518,3.821812,49.183435
2021-875238,2021-09-15,000001,Vente,219200,,,LE VILLAGE,B026,51170,51111,Chambrecy,51,,,511110000B0196,,,,,,,,,,,,,0,,,,,S,sols,,,170,3.821913,49.183519
2021-875536,2021-09-10,000001,Vente,205000,,,LA CROUTE,B008,51170,51111,Chambrecy,51,,,511110000A0505,,,,,,,,,,,,,0,,,,,VI,vignes,VAOC,Vins d'appellation d'origine contrôlée,169,3.823692,49.189293
2021-875536,2021-09-10,000001,Vente,205000,,,LA CROUTE,B008,51170,51111,Chambrecy,51,,,511110000A0507,,,,,,,,,,,,,0,,,,,VI,vignes,VAOC,Vins d'appellation d'origine contrôlée,49,3.823826,49.189219
2021-875536,2021-09-10,000001,Vente,205000,,,LA CROUTE,B008,51170,51111,Chambrecy,51,,,511110000A0512,,,,,,,,,,,,,0,,,,,VI,vignes,VAOC,Vins d'appellation d'origine contrôlée,1667,3.824428,49.189164
2021-875536,2021-09-10,000001,Vente,205000,,,LA CROUTE,B008,51170,51111,Chambrecy,51,,,511110000A0513,,,,,,,,,,,,,0,,,,,VI,vignes,VAOC,Vins d'appellation d'origine contrôlée,569,3.823283,49.189357
