id_mutation,date_mutation,numero_disposition,nature_mutation,valeur_fonciere,adresse_numero,adresse_suffixe,adresse_nom_voie,adresse_code_voie,code_postal,code_commune,nom_commune,code_departement,ancien_code_commune,ancien_nom_commune,id_parcelle,ancien_id_parcelle,numero_volume,lot1_numero,lot1_surface_carrez,lot2_numero,lot2_surface_carrez,lot3_numero,lot3_surface_carrez,lot4_numero,lot4_surface_carrez,lot5_numero,lot5_surface_carrez,nombre_lots,code_type_local,type_local,surface_reelle_bati,nombre_pieces_principales,code_nature_culture,nature_culture,code_nature_culture_speciale,nature_culture_speciale,surface_terrain,longitude,latitude
2021-865831,2021-01-27,000001,Echange,12500,,,LE VILLAGE EST,B066,51130,51154,Clamanges,51,,,511540000D0329,,,,,,,,,,,,,0,,,,,S,sols,,,604,4.082988,48.828474
2021-865831,2021-01-27,000001,Echange,12500,,,LE VILLAGE EST,B066,51130,51154,Clamanges,51,,,511540000D0330,,,,,,,,,,,,,0,,,,,T,terres,,,1706,4.082872,48.828242
2021-865831,2021-01-27,000001,Echange,12500,,,LE VILLAGE EST,B066,51130,51154,Clamanges,51,,,511540000D0342,,,,,,,,,,,,,0,,,,,T,terres,,,215,4.082707,48.827781
2021-865831,2021-01-27,000002,Echange,12500,,,LE VILLAGE OUEST,B067,51130,51154,Clamanges,51,,,511540000D0214,,,,,,,,,,,,,0,,,,,T,terres,,,1195,4.076268,48.827438
2021-865831,2021-01-27,000002,Echange,12500,,,LE VILLAGE OUEST,B067,51130,51154,Clamanges,51,,,511540000D0215,,,,,,,,,,,,,0,,,,,S,sols,,,1841,4.076644,48.827401
2021-865831,2021-01-27,000002,Echange,12500,,,LE VILLAGE OUEST,B067,51130,51154,Clamanges,51,,,511540000D0765,,,,,,,,,,,,,0,,,,,T,terres,,,520,4.076464,48.827771
2021-873026,2021-07-23,000001,Vente,151000,42,,RUE JEAN BRION,0004,51130,51154,Clamanges,51,,,511540000D0452,,,,,,,,,,,,,0,1,Maison,134,6,S,sols,,,935,4.091141,48.829172
2021-873026,2021-07-23,000001,Vente,151000,42,,RUE JEAN BRION,0004,51130,51154,Clamanges,51,,,511540000D0452,,,,,,,,,,,,,0,1,Maison,134,6,J,jardins,,,1120,4.091141,48.829172
2021-873026,2021-07-23,000001,Vente,151000,,,LE VILLAGE EST,B066,51130,51154,Clamanges,51,,,511540000D0890,,,,,,,,,,,,,0,,,,,P,prés,,,663,4.091276,48.828746
2021-873917,2021-07-29,000001,Vente,668910,,,LE TARTRE,B059,51130,51154,Clamanges,51,,,51154000ZB0005,,,,,,,,,,,,,0,,,,,T,terres,,,45670,4.045865,48.838503
2021-875680,2021-09-29,000001,Vente,17000,,,LE VILLAGE EST,B066,51130,51154,Clamanges,51,,,511540000D0324,,,,,,,,,,,,,0,,,,,J,jardins,,,730,4.082984,48.828959
