id_mutation,date_mutation,numero_disposition,nature_mutation,valeur_fonciere,adresse_numero,adresse_suffixe,adresse_nom_voie,adresse_code_voie,code_postal,code_commune,nom_commune,code_departement,ancien_code_commune,ancien_nom_commune,id_parcelle,ancien_id_parcelle,numero_volume,lot1_numero,lot1_surface_carrez,lot2_numero,lot2_surface_carrez,lot3_numero,lot3_surface_carrez,lot4_numero,lot4_surface_carrez,lot5_numero,lot5_surface_carrez,nombre_lots,code_type_local,type_local,surface_reelle_bati,nombre_pieces_principales,code_nature_culture,nature_culture,code_nature_culture_speciale,nature_culture_speciale,surface_terrain,longitude,latitude
2021-865685,2021-01-25,000001,Vente,167250,,,LES BOIS DE LA FORTELLE,B009,51480,51199,Cuchery,51,,,51199000AK0048,,,,,,,,,,,,,0,,,,,S,sols,,,350,3.830633,49.120776
2021-865685,2021-01-25,000001,Vente,167250,11,,RUE DES GRAVIERS,0048,51480,51199,Cuchery,51,,,51199000AK0050,,,,,,,,,,,,,0,1,Maison,89,5,S,sols,,,622,3.83092,49.120884
2021-865726,2021-01-29,000001,Vente,237250,14,,RUE DE LA GAYETTE,0041,51480,51199,Cuchery,51,,,51199000AE0057,,,,,,,,,,,,,0,1,Maison,150,4,S,sols,,,998,3.826181,49.13135
2021-866411,2021-02-18,000001,Vente,3000,,,LE SORBIER,B083,51480,51199,Cuchery,51,,,511990000D1131,,,,,,,,,,,,,0,,,,,T,terres,,,1414,3.82602,49.128906
2021-866411,2021-02-18,000001,Vente,3000,,,LE SORBIER,B083,51480,51199,Cuchery,51,,,511990000D1132,,,,,,,,,,,,,0,,,,,T,terres,,,553,3.825777,49.129072
2021-866411,2021-02-18,000001,Vente,3000,,,LE SORBIER,B083,51480,51199,Cuchery,51,,,511990000D1139,,,,,,,,,,,,,0,,,,,T,terres,,,983,3.826391,49.128907
2021-866411,2021-02-18,000001,Vente,3000,,,LE SORBIER,B083,51480,51199,Cuchery,51,,,511990000D1144,,,,,,,,,,,,,0,,,,,T,terres,,,100,3.826699,49.128874
2021-867626,2021-03-16,000001,Vente,1856,,,ORCOURT,B072,51480,51199,Cuchery,51,,,51199000AK0033,,,,,,,,,,,,,0,,,,,T,terres,,,2320,3.828651,49.121451
2021-867629,2021-03-16,000001,Vente,170000,1,,RUE DE DAMERY,0025,51480,51199,Cuchery,51,,,51199000AK0087,,,,,,,,,,,,,0,1,Maison,74,4,J,jardins,,,1751,3.832063,49.122712
2021-867629,2021-03-16,000001,Vente,170000,1,,RUE DE DAMERY,0025,51480,51199,Cuchery,51,,,51199000AK0087,,,,,,,,,,,,,0,1,Maison,74,4,S,sols,,,500,3.832063,49.122712
2021-867629,2021-03-16,000001,Vente,170000,,,ORCOURT,B072,51480,51199,Cuchery,51,,,51199000AK0088,,,,,,,,,,,,,0,,,,,S,sols,,,81,3.832292,49.122723
2021-867629,2021-03-16,000001,Vente,170000,,,ORCOURT,B072,51480,51199,Cuchery,51,,,51199000AK0089,,,,,,,,,,,,,0,,,,,J,jardins,,,1394,3.832327,49.122587
2021-867630,2021-03-16,000001,Vente,368,,,LES BOURONNERIES,B013,51480,51199,Cuchery,51,,,511990000E0315,,,,,,,,,,,,,0,,,,,BT,taillis simples,,,430,3.823,49.119309
2021-867630,2021-03-16,000001,Vente,368,,,LE BALAI,B003,51480,51199,Cuchery,51,,,51199000ZD0028,,,,,,,,,,,,,0,,,,,T,terres,,,30,3.834994,49.126166
2021-867631,2021-03-19,000001,Vente,15700,,,ORCOURT,B072,51480,51199,Cuchery,51,,,51199000AK0086,,,,,,,,,,,,,0,,,,,J,jardins,,,304,3.831478,49.1225
2021-867632,2021-03-19,000001,Vente,3705,,,LES MEUNIERES,B067,51480,51199,Cuchery,51,,,51199000AH0457,,,,,,,,,,,,,0,,,,,VI,vignes,VAOC,Vins d'appellation d'origine contrôlée,57,3.831927,49.123753
2021-872087,2021-06-28,000001,Vente,35000,16,,RUE DE LA GAYETTE,0041,51480,51199,Cuchery,51,,,51199000AE0056,,,,,,,,,,,,,0,1,Maison,35,2,S,sols,,,463,3.826385,49.13138
2021-875960,2021-10-01,000001,Vente,137800,1,,RUE DU PRESSOIR,0086,51480,51199,Cuchery,51,,,51199000AE0078,,,,,,,,,,,,,0,1,Maison,67,4,S,sols,,,450,3.824542,49.130933
2021-875960,2021-10-01,000001,Vente,137800,1,,RUE DU PRESSOIR,0086,51480,51199,Cuchery,51,,,51199000AE0078,,,,,,,,,,,,,0,3,Dépendance,,0,S,sols,,,450,3.824542,49.130933
2021-875960,2021-10-01,000001,Vente,137800,,,LE VILLAGE,B094,51480,51199,Cuchery,51,,,51199000AE0188,,,,,,,,,,,,,0,,,,,S,sols,,,67,3.824309,49.130989
2021-875960,2021-10-01,000001,Vente,137800,,,LE VILLAGE,B094,51480,51199,Cuchery,51,,,51199000AE0189,,,,,,,,,,,,,0,,,,,S,sols,,,15,3.824413,49.131047
2021-875965,2021-10-01,000001,Vente,215250,,,LE VILLAGE,B094,51480,51199,Cuchery,51,,,51199000AE0068,,,,,,,,,,,,,0,,,,,S,sols,,,286,3.824885,49.13126
2021-875965,2021-10-01,000001,Vente,215250,4,,RUE DE LA GAYETTE,0041,51480,51199,Cuchery,51,,,51199000AE0234,,,,,,,,,,,,,0,1,Maison,70,4,S,sols,,,247,3.824971,49.13129
2021-875965,2021-10-01,000001,Vente,215250,,,LE VILLAGE,B094,51480,51199,Cuchery,51,,,51199000AE0235,,,,,,,,,,,,,0,,,,,S,sols,,,3,3.825069,49.131248
2021-875965,2021-10-01,000001,Vente,215250,,,LE VILLAGE,B094,51480,51199,Cuchery,51,,,51199000AE0237,,,,,,,,,,,,,0,,,,,J,jardins,,,92,3.825031,49.131111
2021-876441,2021-10-20,000002,Echange,350,,,ORCOURT,B072,51480,51199,Cuchery,51,,,51199000AK0129,,,,,,,,,,,,,0,,,,,S,sols,,,39,3.830853,49.122931
2021-876441,2021-10-20,000003,Echange,350,,,ORCOURT,B072,51480,51199,Cuchery,51,,,51199000AK0131,,,,,,,,,,,,,0,,,,,S,sols,,,44,3.830786,49.122995
2021-879557,2021-12-22,000001,Vente,28480,,,LES GAUTELLERIES,B045,51480,51199,Cuchery,51,,,51199000AB0063,,,,,,,,,,,,,0,,,,,VI,vignes,VAOC,Vins d'appellation d'origine contrôlée,200,3.816,49.13877
2021-879557,2021-12-22,000001,Vente,28480,,,LE CHEMIN DE CHAMPLAT,B020,51480,51199,Cuchery,51,,,51199000AB0540,,,,,,,,,,,,,0,,,,,VI,vignes,VAOC,Vins d'appellation d'origine contrôlée,156,3.825517,49.138697
