id_mutation,date_mutation,numero_disposition,nature_mutation,valeur_fonciere,adresse_numero,adresse_suffixe,adresse_nom_voie,adresse_code_voie,code_postal,code_commune,nom_commune,code_departement,ancien_code_commune,ancien_nom_commune,id_parcelle,ancien_id_parcelle,numero_volume,lot1_numero,lot1_surface_carrez,lot2_numero,lot2_surface_carrez,lot3_numero,lot3_surface_carrez,lot4_numero,lot4_surface_carrez,lot5_numero,lot5_surface_carrez,nombre_lots,code_type_local,type_local,surface_reelle_bati,nombre_pieces_principales,code_nature_culture,nature_culture,code_nature_culture_speciale,nature_culture_speciale,surface_terrain,longitude,latitude
2021-866217,2021-02-20,000002,Vente,25000,2,,RUE D ALSACE LORRAINE,0005,51300,51352,Marolles,51,,,51352000ZD0120,,,,,,,,,,,,,0,4,Local industriel. commercial ou assimilé,90,0,S,sols,,,1141,4.61131,48.720039
2021-868558,2021-04-22,000001,Vente,133000,5,,RUE DU BOCAGE,0010,51300,51352,Marolles,51,,,51352000AA0078,,,,,,,,,,,,,0,1,Maison,65,3,S,sols,,,695,4.626017,48.714648
2021-869409,2021-05-07,000001,Vente,148000,,,LES TREMBLEES,B040,51300,51352,Marolles,51,,,51352000ZD0053,,,,,,,,,,,,,0,,,,,J,jardins,,,52,4.610151,48.720316
2021-869409,2021-05-07,000001,Vente,148000,,,LES TREMBLEES,B040,51300,51352,Marolles,51,,,51352000ZD0054,,,,,,,,,,,,,0,,,,,BP,peupleraies,,,7,4.610201,48.720194
2021-869409,2021-05-07,000001,Vente,148000,,,LES TREMBLEES,B040,51300,51352,Marolles,51,,,51352000ZD0055,,,,,,,,,,,,,0,,,,,S,sols,,,80,4.610252,48.719991
2021-869409,2021-05-07,000001,Vente,148000,5000,,LES TREMBLEES,B040,51300,51352,Marolles,51,,,51352000ZD0100,,,,,,,,,,,,,0,1,Maison,98,2,BT,taillis simples,,,2817,4.610514,48.720048
2021-870451,2021-05-31,000001,Vente,20000,,,LES TRAITS,B039,51300,51352,Marolles,51,,,51352000AC0083,,,,,,,,,,,,,0,,,,,T,terres,,,13924,4.620243,48.723657
2021-871073,2021-05-31,000002,Vente,119607224,3,,RUE DES ERABLES,0022,51300,51352,Marolles,51,,,51352000AA0161,,,,,,,,,,,,,0,1,Maison,83,5,S,sols,,,3533,4.620135,48.715395
2021-871073,2021-05-31,000002,Vente,119607224,3,,RUE DES ERABLES,0022,51300,51352,Marolles,51,,,51352000AA0161,,,,,,,,,,,,,0,1,Maison,110,5,S,sols,,,3533,4.620135,48.715395
2021-871073,2021-05-31,000002,Vente,119607224,3,,RUE DES ERABLES,0022,51300,51352,Marolles,51,,,51352000AA0161,,,,,,,,,,,,,0,1,Maison,85,4,S,sols,,,3533,4.620135,48.715395
2021-871073,2021-05-31,000002,Vente,119607224,3,,RUE DES ERABLES,0022,51300,51352,Marolles,51,,,51352000AA0161,,,,,,,,,,,,,0,1,Maison,85,4,S,sols,,,3533,4.620135,48.715395
2021-871073,2021-05-31,000002,Vente,119607224,3,,RUE DES ERABLES,0022,51300,51352,Marolles,51,,,51352000AA0161,,,,,,,,,,,,,0,1,Maison,83,5,S,sols,,,3533,4.620135,48.715395
2021-871073,2021-05-31,000002,Vente,119607224,3,,RUE DES ERABLES,0022,51300,51352,Marolles,51,,,51352000AA0161,,,,,,,,,,,,,0,1,Maison,110,5,S,sols,,,3533,4.620135,48.715395
2021-871073,2021-05-31,000002,Vente,119607224,4,,RUE DES ERABLES,0022,51300,51352,Marolles,51,,,51352000AA0162,,,,,,,,,,,,,0,1,Maison,110,5,S,sols,,,9998,4.620352,48.715705
2021-871073,2021-05-31,000002,Vente,119607224,4,,RUE DES ERABLES,0022,51300,51352,Marolles,51,,,51352000AA0162,,,,,,,,,,,,,0,1,Maison,85,4,S,sols,,,9998,4.620352,48.715705
2021-871073,2021-05-31,000002,Vente,119607224,4,,RUE DES ERABLES,0022,51300,51352,Marolles,51,,,51352000AA0162,,,,,,,,,,,,,0,1,Maison,85,4,S,sols,,,9998,4.620352,48.715705
2021-871073,2021-05-31,000002,Vente,119607224,4,,RUE DES ERABLES,0022,51300,51352,Marolles,51,,,51352000AA0162,,,,,,,,,,,,,0,1,Maison,110,5,S,sols,,,9998,4.620352,48.715705
2021-871073,2021-05-31,000002,Vente,119607224,4,,RUE DES ERABLES,0022,51300,51352,Marolles,51,,,51352000AA0162,,,,,,,,,,,,,0,1,Maison,110,5,S,sols,,,9998,4.620352,48.715705
2021-871073,2021-05-31,000002,Vente,119607224,4,,RUE DES ERABLES,0022,51300,51352,Marolles,51,,,51352000AA0162,,,,,,,,,,,,,0,1,Maison,83,5,S,sols,,,9998,4.620352,48.715705
2021-871073,2021-05-31,000002,Vente,119607224,4,,RUE DES ERABLES,0022,51300,51352,Marolles,51,,,51352000AA0162,,,,,,,,,,,,,0,1,Maison,110,5,S,sols,,,9998,4.620352,48.715705
2021-871073,2021-05-31,000002,Vente,119607224,4,,RUE DES ERABLES,0022,51300,51352,Marolles,51,,,51352000AA0162,,,,,,,,,,,,,0,1,Maison,110,5,S,sols,,,9998,4.620352,48.715705
2021-871073,2021-05-31,000002,Vente,119607224,4,,RUE DES ERABLES,0022,51300,51352,Marolles,51,,,51352000AA0162,,,,,,,,,,,,,0,1,Maison,110,5,S,sols,,,9998,4.620352,48.715705
2021-871073,2021-05-31,000002,Vente,119607224,4,,RUE DES ERABLES,0022,51300,51352,Marolles,51,,,51352000AA0162,,,,,,,,,,,,,0,1,Maison,110,5,S,sols,,,9998,4.620352,48.715705
2021-871073,2021-05-31,000002,Vente,119607224,4,,RUE DES ERABLES,0022,51300,51352,Marolles,51,,,51352000AA0162,,,,,,,,,,,,,0,1,Maison,110,5,S,sols,,,9998,4.620352,48.715705
2021-871073,2021-05-31,000002,Vente,119607224,4,,RUE DES ERABLES,0022,51300,51352,Marolles,51,,,51352000AA0162,,,,,,,,,,,,,0,1,Maison,85,4,S,sols,,,9998,4.620352,48.715705
2021-871073,2021-05-31,000002,Vente,119607224,4,,RUE DES ERABLES,0022,51300,51352,Marolles,51,,,51352000AA0162,,,,,,,,,,,,,0,1,Maison,110,5,S,sols,,,9998,4.620352,48.715705
2021-871073,2021-05-31,000002,Vente,119607224,4,,RUE DES ERABLES,0022,51300,51352,Marolles,51,,,51352000AA0162,,,,,,,,,,,,,0,1,Maison,110,5,S,sols,,,9998,4.620352,48.715705
2021-871073,2021-05-31,000002,Vente,119607224,4,,RUE DES ERABLES,0022,51300,51352,Marolles,51,,,51352000AA0162,,,,,,,,,,,,,0,1,Maison,83,5,S,sols,,,9998,4.620352,48.715705
2021-871073,2021-05-31,000002,Vente,119607224,4,,RUE DES ERABLES,0022,51300,51352,Marolles,51,,,51352000AA0162,,,,,,,,,,,,,0,1,Maison,85,4,S,sols,,,9998,4.620352,48.715705
2021-871073,2021-05-31,000002,Vente,119607224,4,,RUE DES ERABLES,0022,51300,51352,Marolles,51,,,51352000AA0162,,,,,,,,,,,,,0,1,Maison,85,4,S,sols,,,9998,4.620352,48.715705
2021-871073,2021-05-31,000002,Vente,119607224,4,,RUE DES ERABLES,0022,51300,51352,Marolles,51,,,51352000AA0162,,,,,,,,,,,,,0,1,Maison,83,5,S,sols,,,9998,4.620352,48.715705
2021-871073,2021-05-31,000002,Vente,119607224,2,,RUE DES ERABLES,0022,51300,51352,Marolles,51,,,51352000AA0163,,,,,,,,,,,,,0,1,Maison,83,5,S,sols,,,1154,4.620886,48.715096
2021-871073,2021-05-31,000002,Vente,119607224,1,,RUE DES ERABLES,0022,51300,51352,Marolles,51,,,51352000AA0165,,,,,,,,,,,,,0,1,Maison,110,6,S,sols,,,2233,4.620314,48.714943
2021-871073,2021-05-31,000002,Vente,119607224,1,,RUE DES ERABLES,0022,51300,51352,Marolles,51,,,51352000AA0165,,,,,,,,,,,,,0,1,Maison,110,5,S,sols,,,2233,4.620314,48.714943
2021-871073,2021-05-31,000002,Vente,119607224,1,,RUE DES ERABLES,0022,51300,51352,Marolles,51,,,51352000AA0165,,,,,,,,,,,,,0,1,Maison,110,5,S,sols,,,2233,4.620314,48.714943
2021-871073,2021-05-31,000002,Vente,119607224,40,,RUE DES ERABLES,0022,51300,51352,Marolles,51,,,51352000AA0168,,,,,,,,,,,,,0,1,Maison,110,5,S,sols,,,1007,4.619778,48.714838
2021-871073,2021-05-31,000002,Vente,119607224,40,,RUE DES ERABLES,0022,51300,51352,Marolles,51,,,51352000AA0168,,,,,,,,,,,,,0,1,Maison,110,5,S,sols,,,1007,4.619778,48.714838
2021-871073,2021-05-31,000002,Vente,119607224,,,LE CHEMIN GOURE,B009,51300,51352,Marolles,51,,,51352000AA0169,,,,,,,,,,,,,0,,,,,S,sols,,,38,4.62109,48.714922
2021-871073,2021-05-31,000002,Vente,119607224,,,LE CHEMIN GOURE,B009,51300,51352,Marolles,51,,,51352000AA0171,,,,,,,,,,,,,0,,,,,S,sols,,,71,4.6207,48.714834
2021-871073,2021-05-31,000002,Vente,119607224,,,LE CHEMIN GOURE,B009,51300,51352,Marolles,51,,,51352000AA0172,,,,,,,,,,,,,0,,,,,S,sols,,,132,4.62014,48.714688
2021-871073,2021-05-31,000002,Vente,119607224,,,LE CHEMIN GOURE,B009,51300,51352,Marolles,51,,,51352000AA0174,,,,,,,,,,,,,0,,,,,S,sols,,,184,4.61982,48.714617
2021-871073,2021-05-31,000002,Vente,119607224,,,LE CHEMIN GOURE,B009,51300,51352,Marolles,51,,,51352000AA0175,,,,,,,,,,,,,0,,,,,S,sols,,,3,4.620063,48.71464
2021-871073,2021-05-31,000002,Vente,119607224,,,LE CHEMIN GOURE,B009,51300,51352,Marolles,51,,,51352000AA0177,,,,,,,,,,,,,0,,,,,S,sols,,,171,4.619803,48.714542
2021-871073,2021-05-31,000002,Vente,119607224,6,,RUE DE LA FONTAINE MORME,0030,51300,51352,Marolles,51,,,51352000AB0253,,,,,,,,,,,,,0,,,,,S,sols,,,7,4.62687,48.718198
2021-871073,2021-05-31,000002,Vente,119607224,6,,RUE DE LA FONTAINE MORME,0030,51300,51352,Marolles,51,,,51352000AB0254,,,,,,,,,,,,,0,1,Maison,74,4,S,sols,,,286,4.626861,48.718241
2021-871073,2021-05-31,000002,Vente,119607224,,,LE QUARTIER OUDET,B034,51300,51352,Marolles,51,,,51352000AB0258,,,,,,,,,,,,,0,,,,,S,sols,,,5,4.626955,48.718295
2021-871073,2021-05-31,000002,Vente,119607224,6,,RUE DE LA FONTAINE MORME,0030,51300,51352,Marolles,51,,,51352000AB0259,,,,,,,,,,,,,0,1,Maison,87,5,S,sols,,,289,4.626703,48.718442
2021-871073,2021-05-31,000002,Vente,119607224,6,,RUE DE LA FONTAINE MORME,0030,51300,51352,Marolles,51,,,51352000AB0260,,,,,,,,,,,,,0,,,,,S,sols,,,40,4.626809,48.718457
2021-871073,2021-05-31,000002,Vente,119607224,6,,RUE DE LA FONTAINE MORME,0030,51300,51352,Marolles,51,,,51352000AB0263,,,,,,,,,,,,,0,1,Maison,73,4,S,sols,,,367,4.626842,48.718481
2021-871073,2021-05-31,000002,Vente,119607224,6,,RUE DE LA FONTAINE MORME,0030,51300,51352,Marolles,51,,,51352000AB0264,,,,,,,,,,,,,0,,,,,S,sols,,,171,4.626572,48.718553
2021-871073,2021-05-31,000002,Vente,119607224,6,,RUE DE LA FONTAINE MORME,0030,51300,51352,Marolles,51,,,51352000AB0268,,,,,,,,,,,,,0,,,,,S,sols,,,136,4.626797,48.718624
2021-871073,2021-05-31,000002,Vente,119607224,6,,RUE DE LA FONTAINE MORME,0030,51300,51352,Marolles,51,,,51352000AB0269,,,,,,,,,,,,,0,,,,,S,sols,,,73,4.626573,48.718634
2021-871073,2021-05-31,000002,Vente,119607224,6,,RUE DE LA FONTAINE MORME,0030,51300,51352,Marolles,51,,,51352000AB0270,,,,,,,,,,,,,0,,,,,S,sols,,,14,4.627085,48.718543
2021-871073,2021-05-31,000002,Vente,119607224,6,,RUE DE LA FONTAINE MORME,0030,51300,51352,Marolles,51,,,51352000AB0272,,,,,,,,,,,,,0,1,Maison,74,4,S,sols,,,525,4.627317,48.718584
2021-871073,2021-05-31,000002,Vente,119607224,6,,RUE DE LA FONTAINE MORME,0030,51300,51352,Marolles,51,,,51352000AB0276,,,,,,,,,,,,,0,,,,,S,sols,,,96,4.627603,48.718565
2021-871073,2021-05-31,000002,Vente,119607224,6,,RUE DE LA FONTAINE MORME,0030,51300,51352,Marolles,51,,,51352000AB0286,,,,,,,,,,,,,0,,,,,S,sols,,,22,4.626731,48.718259
2021-871073,2021-05-31,000002,Vente,119607224,,,LES PENDANTS DES TRAITS,B024,51300,51352,Marolles,51,,,51352000ZD0021,,,,,,,,,,,,,0,,,,,T,terres,,,1263,4.619431,48.717503
2021-872114,2021-06-30,000002,Vente,113890,9,,RUE DE LA VIOLETTE,0120,51300,51352,Marolles,51,,,51352000AC0035,,,,,,,,,,,,,0,4,Local industriel. commercial ou assimilé,1574,0,S,sols,,,2405,4.616538,48.723127
2021-872114,2021-06-30,000002,Vente,113890,,,LA VIOLETTE,B044,51300,51352,Marolles,51,,,51352000AC0147,,,,,,,,,,,,,0,,,,,S,sols,,,889,4.615881,48.723075
2021-872245,2021-06-24,000001,Vente,170000,6,,RUE SAINT HUBERT,0085,51300,51352,Marolles,51,,,51352000AB0290,,,,,,,,,,,,,0,1,Maison,200,7,S,sols,,,1321,4.624892,48.716731
2021-872245,2021-06-24,000001,Vente,170000,6,,RUE SAINT HUBERT,0085,51300,51352,Marolles,51,,,51352000AB0290,,,,,,,,,,,,,0,3,Dépendance,,0,S,sols,,,1321,4.624892,48.716731
2021-872245,2021-06-24,000001,Vente,170000,6,,RUE SAINT HUBERT,0085,51300,51352,Marolles,51,,,51352000AB0290,,,,,,,,,,,,,0,3,Dépendance,,0,S,sols,,,1321,4.624892,48.716731
2021-872245,2021-06-24,000001,Vente,170000,6,,RUE SAINT HUBERT,0085,51300,51352,Marolles,51,,,51352000AB0290,,,,,,,,,,,,,0,3,Dépendance,,0,S,sols,,,1321,4.624892,48.716731
2021-873517,2021-07-28,000001,Vente,165570,24,,RUE DES CHARMILLES,0015,51300,51352,Marolles,51,,,51352000AB0002,,,,,,,,,,,,,0,3,Dépendance,,0,S,sols,,,666,4.624119,48.720209
2021-873517,2021-07-28,000001,Vente,165570,24,,RUE DES CHARMILLES,0015,51300,51352,Marolles,51,,,51352000AB0002,,,,,,,,,,,,,0,1,Maison,112,5,S,sols,,,666,4.624119,48.720209
2021-873517,2021-07-28,000001,Vente,165570,24,,RUE DES CHARMILLES,0015,51300,51352,Marolles,51,,,51352000AB0002,,,,,,,,,,,,,0,3,Dépendance,,0,S,sols,,,666,4.624119,48.720209
2021-873517,2021-07-28,000001,Vente,165570,,,LE VILLAGE,B043,51300,51352,Marolles,51,,,51352000AB0003,,,,,,,,,,,,,0,,,,,S,sols,,,57,4.62437,48.720239
2021-876267,2021-10-12,000001,Vente,200000,,,SUR LE CHEMIN DES PENDUS,B008,51300,51352,Marolles,51,,,51352000AC0004,,,,,,,,,,,,,0,,,,,S,sols,,,138,4.610845,48.728696
2021-876299,2021-09-04,000001,Vente,60000,2,,RUE DES ORMEAUX,0070,51300,51352,Marolles,51,,,51352000AA0135,,,,,,,,,,,,,0,1,Maison,108,5,S,sols,,,808,4.62312,48.715547
2021-876299,2021-09-04,000001,Vente,60000,2,,RUE DES ORMEAUX,0070,51300,51352,Marolles,51,,,51352000AA0135,,,,,,,,,,,,,0,3,Dépendance,,0,S,sols,,,808,4.62312,48.715547
2021-876421,2021-10-01,000002,Vente,100000,500,,RUE DE LA VIOLETTE,0120,51300,51352,Marolles,51,,,51352000AC0144,,,,,,,,,,,,,0,,,,,T,terres,,,10000,4.62022,48.725312
2021-878379,2021-12-08,000001,Vente,84000,,,SUR LES JARDINS,B018,51300,51352,Marolles,51,,,51352000AB0370,,,,,,,,,,,,,0,,,,,S,sols,,,413,4.62229,48.717202
2021-878850,2021-12-16,000001,Vente,84000,,,SUR LES JARDINS,B018,51300,51352,Marolles,51,,,51352000AB0315,,,,,,,,,,,,,0,,,,,S,sols,,,192,4.622035,48.716756
