id_mutation,date_mutation,numero_disposition,nature_mutation,valeur_fonciere,adresse_numero,adresse_suffixe,adresse_nom_voie,adresse_code_voie,code_postal,code_commune,nom_commune,code_departement,ancien_code_commune,ancien_nom_commune,id_parcelle,ancien_id_parcelle,numero_volume,lot1_numero,lot1_surface_carrez,lot2_numero,lot2_surface_carrez,lot3_numero,lot3_surface_carrez,lot4_numero,lot4_surface_carrez,lot5_numero,lot5_surface_carrez,nombre_lots,code_type_local,type_local,surface_reelle_bati,nombre_pieces_principales,code_nature_culture,nature_culture,code_nature_culture_speciale,nature_culture_speciale,surface_terrain,longitude,latitude
2021-867849,2021-03-30,000001,Vente,45820,,,AU SABLE,B071,51210,51359,Mécringes,51,,,51359000ZA0024,,,,,,,,,,,,,0,,,,,BS,taillis sous futaie,,,6236,3.546244,48.820986
2021-867849,2021-03-30,000001,Vente,45820,,,LA FONTAINE DES CHOUQUEUX,B033,51210,51359,Mécringes,51,,,51359000ZA0051,,,,,,,,,,,,,0,,,,,BS,taillis sous futaie,,,9960,3.559917,48.821962
2021-871057,2021-06-14,000001,Vente,1200,,,LA NOUE AGON,B056,51210,51359,Mécringes,51,,,51359000ZK0024,,,,,,,,,,,,,0,,,,,BS,taillis sous futaie,,,1930,3.536863,48.843431
2021-871057,2021-06-14,000001,Vente,1200,,,LA NOUE AGON,B056,51210,51359,Mécringes,51,,,51359000ZK0024,,,,,,,,,,,,,0,,,,,B,bois,,,482,3.536863,48.843431
2021-871507,2021-06-22,000001,Vente,215000,17,,RUE DES BOURGEOIS,0090,51210,51359,Mécringes,51,,,51359000ZD0102,,,,,,,,,,,,,0,1,Maison,173,10,S,sols,,,536,3.511598,48.855581
2021-871507,2021-06-22,000001,Vente,215000,17,,RUE DES BOURGEOIS,0090,51210,51359,Mécringes,51,,,51359000ZD0102,,,,,,,,,,,,,0,1,Maison,33,1,S,sols,,,536,3.511598,48.855581
2021-871507,2021-06-22,000001,Vente,215000,17,,RUE DES BOURGEOIS,0090,51210,51359,Mécringes,51,,,51359000ZD0102,,,,,,,,,,,,,0,1,Maison,33,1,J,jardins,,,1054,3.511598,48.855581
2021-871507,2021-06-22,000001,Vente,215000,17,,RUE DES BOURGEOIS,0090,51210,51359,Mécringes,51,,,51359000ZD0102,,,,,,,,,,,,,0,1,Maison,173,10,J,jardins,,,1054,3.511598,48.855581
2021-872938,2021-07-28,000001,Vente,4988,,,LA CHAMPAGNE,B016,51210,51359,Mécringes,51,,,51359000ZL0011,,,,,,,,,,,,,0,,,,,BS,taillis sous futaie,,,4834,3.542287,48.835122
2021-872938,2021-07-28,000001,Vente,4988,,,LA CHAMPAGNE,B016,51210,51359,Mécringes,51,,,51359000ZL0011,,,,,,,,,,,,,0,,,,,B,bois,,,478,3.542287,48.835122
2021-873016,2021-07-22,000001,Vente,50870,,,LA CROIX DU GUET,B025,51210,51359,Mécringes,51,,,51359000ZK0054,,,,,,,,,,,,,0,,,,,T,terres,,,61290,3.528891,48.84309
2021-874426,2021-09-09,000001,Vente,385.7,,,LA FONTAINE DES CHOUQUEUX,B033,51210,51359,Mécringes,51,,,51359000ZA0052,,,,,,,,,,,,,0,,,,,BS,taillis sous futaie,,,1102,3.561026,48.822454
2021-874927,2021-09-17,000001,Vente,51000,,,LES RUS,B070,51210,51359,Mécringes,51,,,51359000ZE0092,,,,,,,,,,,,,0,,,,,B,bois,,,1059,3.528895,48.85843
2021-874927,2021-09-17,000001,Vente,51000,,,LES RUS,B070,51210,51359,Mécringes,51,,,51359000ZE0097,,,,,,,,,,,,,0,,,,,B,bois,,,472,3.528752,48.859357
2021-878352,2021-12-10,000001,Vente,205000,5,,RUE DES GUEUX,0750,51210,51359,Mécringes,51,,,51359000ZD0093,,,,,,,,,,,,,0,1,Maison,101,2,S,sols,,,500,3.51494,48.851314
2021-878352,2021-12-10,000001,Vente,205000,5,,RUE DES GUEUX,0750,51210,51359,Mécringes,51,,,51359000ZD0093,,,,,,,,,,,,,0,1,Maison,101,2,J,jardins,,,1042,3.51494,48.851314
