id_mutation,date_mutation,numero_disposition,nature_mutation,valeur_fonciere,adresse_numero,adresse_suffixe,adresse_nom_voie,adresse_code_voie,code_postal,code_commune,nom_commune,code_departement,ancien_code_commune,ancien_nom_commune,id_parcelle,ancien_id_parcelle,numero_volume,lot1_numero,lot1_surface_carrez,lot2_numero,lot2_surface_carrez,lot3_numero,lot3_surface_carrez,lot4_numero,lot4_surface_carrez,lot5_numero,lot5_surface_carrez,nombre_lots,code_type_local,type_local,surface_reelle_bati,nombre_pieces_principales,code_nature_culture,nature_culture,code_nature_culture_speciale,nature_culture_speciale,surface_terrain,longitude,latitude
2021-865976,2021-02-01,000002,Vente,14685,,,LA COTE DES VINS,B017,51600,51486,Saint-Hilaire-le-Grand,51,,,51486000YM0031,,,,,,,,,,,,,0,,,,,T,terres,,,7663,4.469912,49.181188
2021-865976,2021-02-01,000002,Vente,14685,,,LA COTE DES VINS,B017,51600,51486,Saint-Hilaire-le-Grand,51,,,51486000YM0032,,,,,,,,,,,,,0,,,,,T,terres,,,2127,4.469882,49.181711
2021-865994,2021-02-01,000001,Vente,150000,,,GROS,B039,51600,51486,Saint-Hilaire-le-Grand,51,,,51486000YC0018,,,,,,,,,,,,,0,,,,,T,terres,,,30168,4.496206,49.202965
2021-865994,2021-02-01,000001,Vente,150000,,,GROS,B039,51600,51486,Saint-Hilaire-le-Grand,51,,,51486000YC0018,,,,,,,,,,,,,0,,,,,T,terres,,,20112,4.496206,49.202965
2021-866625,2021-02-16,000001,Vente,140000,1,,RUE DU MOULIN,0035,51600,51486,Saint-Hilaire-le-Grand,51,,,51486000AC0034,,,,,,,,,,,,,0,4,Local industriel. commercial ou assimilé,50,0,S,sols,,,434,4.46881,49.168688
2021-866625,2021-02-16,000001,Vente,140000,1,,RUE DU MOULIN,0035,51600,51486,Saint-Hilaire-le-Grand,51,,,51486000AC0034,,,,,,,,,,,,,0,1,Maison,123,6,S,sols,,,434,4.46881,49.168688
2021-866625,2021-02-16,000001,Vente,140000,5035,,LE PETIT CALORIN,B058,51600,51486,Saint-Hilaire-le-Grand,51,,,51486000AC0105,,,,,,,,,,,,,0,4,Local industriel. commercial ou assimilé,,,BT,taillis simples,,,3278,4.467895,49.168229
2021-866625,2021-02-16,000001,Vente,140000,5035,,LE PETIT CALORIN,B058,51600,51486,Saint-Hilaire-le-Grand,51,,,51486000AC0105,,,,,,,,,,,,,0,4,Local industriel. commercial ou assimilé,,,S,sols,,,2092,4.467895,49.168229
2021-866625,2021-02-16,000001,Vente,140000,5035,,LE PETIT CALORIN,B058,51600,51486,Saint-Hilaire-le-Grand,51,,,51486000AC0105,,,,,,,,,,,,,0,4,Local industriel. commercial ou assimilé,,,T,terres,,,666,4.467895,49.168229
2021-866625,2021-02-16,000001,Vente,140000,,,LE PETIT CALORIN,B058,51600,51486,Saint-Hilaire-le-Grand,51,,,51486000AC0106,,,,,,,,,,,,,0,,,,,S,sols,,,440,4.469407,49.168312
2021-866625,2021-02-16,000001,Vente,140000,,,LE PETIT CALORIN,B058,51600,51486,Saint-Hilaire-le-Grand,51,,,51486000AC0106,,,,,,,,,,,,,0,,,,,T,terres,,,2400,4.469407,49.168312
2021-866625,2021-02-16,000001,Vente,140000,5116,,LE PETIT CALORIN,B058,51600,51486,Saint-Hilaire-le-Grand,51,,,51486000AC0107,,,,,,,,,,,,,0,4,Local industriel. commercial ou assimilé,417,0,T,terres,,,1292,4.468775,49.168266
2021-866625,2021-02-16,000001,Vente,140000,5116,,LE PETIT CALORIN,B058,51600,51486,Saint-Hilaire-le-Grand,51,,,51486000AC0107,,,,,,,,,,,,,0,4,Local industriel. commercial ou assimilé,417,0,S,sols,,,1395,4.468775,49.168266
2021-866625,2021-02-16,000001,Vente,140000,,,LE PETIT CALORIN,B058,51600,51486,Saint-Hilaire-le-Grand,51,,,51486000AC0108,,,,,,,,,,,,,0,,,,,S,sols,,,260,4.468106,49.167771
2021-866625,2021-02-16,000001,Vente,140000,,,LE PETIT CALORIN,B058,51600,51486,Saint-Hilaire-le-Grand,51,,,51486000AC0108,,,,,,,,,,,,,0,,,,,T,terres,,,3065,4.468106,49.167771
2021-866625,2021-02-16,000001,Vente,140000,,,LE PETIT CALORIN,B058,51600,51486,Saint-Hilaire-le-Grand,51,,,51486000AC0108,,,,,,,,,,,,,0,,,,,BT,taillis simples,,,892,4.468106,49.167771
2021-866625,2021-02-16,000001,Vente,140000,,,LE CALORIN,B010,51600,51486,Saint-Hilaire-le-Grand,51,,,51486000AC0135,,,,,,,,,,,,,0,,,,,S,sols,,,2147,4.46924,49.169224
2021-866625,2021-02-16,000001,Vente,140000,5034,,RUE DU MOULIN,0035,51600,51486,Saint-Hilaire-le-Grand,51,,,51486000AC0136,,,,,,,,,,,,,0,4,Local industriel. commercial ou assimilé,45,0,S,sols,,,1936,4.468881,49.168827
2021-866625,2021-02-16,000001,Vente,140000,5034,,RUE DU MOULIN,0035,51600,51486,Saint-Hilaire-le-Grand,51,,,51486000AC0137,,,,,,,,,,,,,0,3,Dépendance,,0,S,sols,,,179,4.469163,49.168721
2021-866625,2021-02-16,000001,Vente,140000,5034,,RUE DU MOULIN,0035,51600,51486,Saint-Hilaire-le-Grand,51,,,51486000AC0137,,,,,,,,,,,,,0,1,Maison,40,3,S,sols,,,179,4.469163,49.168721
2021-866625,2021-02-16,000001,Vente,140000,,,LE CALORIN,B010,51600,51486,Saint-Hilaire-le-Grand,51,,,51486000AC0138,,,,,,,,,,,,,0,,,,,S,sols,,,486,4.469539,49.169128
2021-866625,2021-02-16,000001,Vente,140000,,,LE CALORIN,B010,51600,51486,Saint-Hilaire-le-Grand,51,,,51486000AC0139,,,,,,,,,,,,,0,,,,,S,sols,,,1440,4.46968,49.169032
2021-866625,2021-02-16,000001,Vente,140000,,,LE CALORIN,B010,51600,51486,Saint-Hilaire-le-Grand,51,,,51486000AC0139,,,,,,,,,,,,,0,,,,,T,terres,,,550,4.46968,49.169032
2021-867643,2021-03-12,000001,Vente,20000,,,LES TROIS MOINEAUX,B077,51600,51486,Saint-Hilaire-le-Grand,51,,,51486000AC0175,,,,,,,,,,,,,0,,,,,J,jardins,,,445,4.468524,49.170071
2021-867643,2021-03-12,000001,Vente,20000,,,LES TROIS MOINEAUX,B077,51600,51486,Saint-Hilaire-le-Grand,51,,,51486000AC0176,,,,,,,,,,,,,0,,,,,S,sols,,,4,4.468616,49.16999
2021-871251,2021-06-04,000001,Vente,140000,3,,RUE DE SOUAIN,0068,51600,51486,Saint-Hilaire-le-Grand,51,,,51486000AB0076,,,,,,,,,,,,,0,3,Dépendance,,0,S,sols,,,402,4.464899,49.171302
2021-871251,2021-06-04,000001,Vente,140000,3,,RUE DE SOUAIN,0068,51600,51486,Saint-Hilaire-le-Grand,51,,,51486000AB0076,,,,,,,,,,,,,0,3,Dépendance,,0,S,sols,,,402,4.464899,49.171302
2021-871251,2021-06-04,000001,Vente,140000,3,,RUE DE SOUAIN,0068,51600,51486,Saint-Hilaire-le-Grand,51,,,51486000AB0076,,,,,,,,,,,,,0,1,Maison,122,5,S,sols,,,402,4.464899,49.171302
2021-874141,2021-08-17,000001,Vente,146290,6,,RUE DE CEINTURE,0010,51600,51486,Saint-Hilaire-le-Grand,51,,,51486000AC0149,,,,,,,,,,,,,0,1,Maison,96,3,S,sols,,,594,4.466409,49.170486
2021-878519,2021-12-02,000002,Vente,165000,5135,,RUE DU CHEF DES BOIS,0013,51600,51486,Saint-Hilaire-le-Grand,51,,,51486000AA0116,,,,,,,,,,,,,0,1,Maison,109,5,S,sols,,,837,4.458052,49.17197
2021-878519,2021-12-02,000002,Vente,165000,5135,,RUE DU CHEF DES BOIS,0013,51600,51486,Saint-Hilaire-le-Grand,51,,,51486000AA0116,,,,,,,,,,,,,0,3,Dépendance,,0,S,sols,,,837,4.458052,49.17197
2021-879289,2021-12-29,000001,Vente,135000,2,,RUE JEAN GILLET,0030,51600,51486,Saint-Hilaire-le-Grand,51,,,51486000AA0051,,,,,,,,,,,,,0,1,Maison,77,4,S,sols,,,525,4.461609,49.171926
2021-879289,2021-12-29,000001,Vente,135000,2,,RUE JEAN GILLET,0030,51600,51486,Saint-Hilaire-le-Grand,51,,,51486000AA0051,,,,,,,,,,,,,0,3,Dépendance,,0,S,sols,,,525,4.461609,49.171926
2021-879289,2021-12-29,000001,Vente,135000,2,,RUE JEAN GILLET,0030,51600,51486,Saint-Hilaire-le-Grand,51,,,51486000AA0051,,,,,,,,,,,,,0,3,Dépendance,,0,S,sols,,,525,4.461609,49.171926
