id_mutation,date_mutation,numero_disposition,nature_mutation,valeur_fonciere,adresse_numero,adresse_suffixe,adresse_nom_voie,adresse_code_voie,code_postal,code_commune,nom_commune,code_departement,ancien_code_commune,ancien_nom_commune,id_parcelle,ancien_id_parcelle,numero_volume,lot1_numero,lot1_surface_carrez,lot2_numero,lot2_surface_carrez,lot3_numero,lot3_surface_carrez,lot4_numero,lot4_surface_carrez,lot5_numero,lot5_surface_carrez,nombre_lots,code_type_local,type_local,surface_reelle_bati,nombre_pieces_principales,code_nature_culture,nature_culture,code_nature_culture_speciale,nature_culture_speciale,surface_terrain,longitude,latitude
2021-880169,2021-01-21,000001,Vente,163794,6,,RUE GRANDE RUE,0110,52130,52021,Attancourt,52,,,520210000C0447,,,,,,,,,,,,,0,3,Dépendance,,0,S,sols,,,1439,4.930689,48.524268
2021-880169,2021-01-21,000001,Vente,163794,6,,RUE GRANDE RUE,0110,52130,52021,Attancourt,52,,,520210000C0447,,,,,,,,,,,,,0,1,Maison,187,6,S,sols,,,1439,4.930689,48.524268
2021-880169,2021-01-21,000001,Vente,163794,6,,RUE GRANDE RUE,0110,52130,52021,Attancourt,52,,,520210000C0447,,,,,,,,,,,,,0,3,Dépendance,,0,S,sols,,,1439,4.930689,48.524268
2021-881578,2021-05-11,000001,Vente,112000,6,,RUE DES MARRONNIERS,0150,52130,52021,Attancourt,52,,,520210000C0461,,,,,,,,,,,,,0,1,Maison,84,4,S,sols,,,279,4.929827,48.523218
2021-881578,2021-05-11,000001,Vente,112000,6,,RUE DES MARRONNIERS,0150,52130,52021,Attancourt,52,,,520210000C0461,,,,,,,,,,,,,0,1,Maison,84,4,J,jardins,,,1028,4.929827,48.523218
2021-881578,2021-05-11,000001,Vente,112000,,,VILLAGE,B094,52130,52021,Attancourt,52,,,520210000C0588,,,,,,,,,,,,,0,,,,,J,jardins,,,45,4.929402,48.523076
2021-881621,2021-05-21,000001,Vente,223000,4,,RUE GRANDE RUE,0110,52130,52021,Attancourt,52,,,520210000C0591,,,,,,,,,,,,,0,3,Dépendance,,0,S,sols,,,1617,4.931254,48.524171
2021-881621,2021-05-21,000001,Vente,223000,4,,RUE GRANDE RUE,0110,52130,52021,Attancourt,52,,,520210000C0591,,,,,,,,,,,,,0,1,Maison,173,6,P,prés,,,4088,4.931254,48.524171
2021-881621,2021-05-21,000001,Vente,223000,4,,RUE GRANDE RUE,0110,52130,52021,Attancourt,52,,,520210000C0591,,,,,,,,,,,,,0,3,Dépendance,,0,P,prés,,,4088,4.931254,48.524171
2021-881621,2021-05-21,000001,Vente,223000,4,,RUE GRANDE RUE,0110,52130,52021,Attancourt,52,,,520210000C0591,,,,,,,,,,,,,0,3,Dépendance,,0,P,prés,,,4088,4.931254,48.524171
2021-881621,2021-05-21,000001,Vente,223000,4,,RUE GRANDE RUE,0110,52130,52021,Attancourt,52,,,520210000C0591,,,,,,,,,,,,,0,1,Maison,173,6,S,sols,,,1617,4.931254,48.524171
2021-881621,2021-05-21,000001,Vente,223000,4,,RUE GRANDE RUE,0110,52130,52021,Attancourt,52,,,520210000C0591,,,,,,,,,,,,,0,3,Dépendance,,0,S,sols,,,1617,4.931254,48.524171
2021-882888,2021-08-30,000003,Echange,860,,,CHEMIN MARCHAND,B018,52130,52021,Attancourt,52,,,52021000ZB0017,,,,,,,,,,,,,0,,,,,P,prés,,,1000,4.93355,48.529249
2021-883790,2021-10-23,000001,Vente,18000,4,,RUE DE LA MOTHE,0160,52130,52021,Attancourt,52,,,520210000C0112,,,,,,,,,,,,,0,1,Maison,94,3,S,sols,,,1155,4.930395,48.525831
2021-884638,2021-12-23,000001,Vente,189000,4,,RUE GRANDE RUELLE,0120,52130,52021,Attancourt,52,,,520210000C0606,,,,,,,,,,,,,0,1,Maison,117,6,S,sols,,,846,4.929374,48.527105
