id_mutation,date_mutation,numero_disposition,nature_mutation,valeur_fonciere,adresse_numero,adresse_suffixe,adresse_nom_voie,adresse_code_voie,code_postal,code_commune,nom_commune,code_departement,ancien_code_commune,ancien_nom_commune,id_parcelle,ancien_id_parcelle,numero_volume,lot1_numero,lot1_surface_carrez,lot2_numero,lot2_surface_carrez,lot3_numero,lot3_surface_carrez,lot4_numero,lot4_surface_carrez,lot5_numero,lot5_surface_carrez,nombre_lots,code_type_local,type_local,surface_reelle_bati,nombre_pieces_principales,code_nature_culture,nature_culture,code_nature_culture_speciale,nature_culture_speciale,surface_terrain,longitude,latitude
2021-881046,2021-03-29,000001,Vente,4000,,,VILLAGE,B121,52190,52027,Aujeurres,52,,,520270000E0133,,,,,,,,,,,,,0,,,,,S,sols,,,261,5.181638,47.740489
2021-881984,2021-06-03,000001,Vente,66000,,,BOISDELET,B008,52190,52027,Aujeurres,52,,,52027000ZD0014,,,,,,,,,,,,,0,,,,,J,jardins,POTAG,Jardin potager,140,5.1827,47.740132
2021-881984,2021-06-03,000001,Vente,66000,10,,RUE DES GARGOUILLES,0032,52190,52027,Aujeurres,52,,,52027000ZD0015,,,,,,,,,,,,,0,3,Dépendance,,0,S,sols,,,1033,5.182607,47.739922
2021-881984,2021-06-03,000001,Vente,66000,10,,RUE DES GARGOUILLES,0032,52190,52027,Aujeurres,52,,,52027000ZD0015,,,,,,,,,,,,,0,1,Maison,124,5,P,prés,,,1127,5.182607,47.739922
2021-881984,2021-06-03,000001,Vente,66000,10,,RUE DES GARGOUILLES,0032,52190,52027,Aujeurres,52,,,52027000ZD0015,,,,,,,,,,,,,0,3,Dépendance,,0,P,prés,,,1127,5.182607,47.739922
2021-881984,2021-06-03,000001,Vente,66000,10,,RUE DES GARGOUILLES,0032,52190,52027,Aujeurres,52,,,52027000ZD0015,,,,,,,,,,,,,0,1,Maison,124,5,S,sols,,,1033,5.182607,47.739922
2021-884074,2021-11-19,000001,Vente,50000,,,VILLAGE,B121,52190,52027,Aujeurres,52,,,520270000E0077,,,,,,,,,,,,,0,,,,,P,prés,,,412,5.184246,47.740546
2021-884074,2021-11-19,000001,Vente,50000,6,,PL DE LA PEUTE BETE,0043,52190,52027,Aujeurres,52,,,520270000E0144,,,,,,,,,,,,,0,1,Maison,74,2,S,sols,,,601,5.18366,47.74089
2021-884074,2021-11-19,000001,Vente,50000,,,VILLAGE,B121,52190,52027,Aujeurres,52,,,520270000E0227,,,,,,,,,,,,,0,,,,,S,sols,,,26,5.183895,47.740837
