id_mutation,date_mutation,numero_disposition,nature_mutation,valeur_fonciere,adresse_numero,adresse_suffixe,adresse_nom_voie,adresse_code_voie,code_postal,code_commune,nom_commune,code_departement,ancien_code_commune,ancien_nom_commune,id_parcelle,ancien_id_parcelle,numero_volume,lot1_numero,lot1_surface_carrez,lot2_numero,lot2_surface_carrez,lot3_numero,lot3_surface_carrez,lot4_numero,lot4_surface_carrez,lot5_numero,lot5_surface_carrez,nombre_lots,code_type_local,type_local,surface_reelle_bati,nombre_pieces_principales,code_nature_culture,nature_culture,code_nature_culture_speciale,nature_culture_speciale,surface_terrain,longitude,latitude
2021-880201,2021-01-25,000001,Vente,4200,8,,RTE DE CLINCHAMP,0012,52700,52095,Chalvraines,52,,,520950000D0468,,,,,,,,,,,,,0,1,Maison,46,1,S,sols,,,378,5.47933,48.239749
2021-880399,2021-02-05,000001,Vente,200,,,HAUT DU MOULIN,B014,52700,52095,Chalvraines,52,,,52095000ZB0044,,,,,,,,,,,,,0,,,,,J,jardins,,,250,5.480213,48.241863
2021-880453,2021-02-08,000001,Vente,90000,2,,CHE DES JARDINS,0037,52700,52095,Chalvraines,52,,,52095000ZA0085,,,,,,,,,,,,,0,3,Dépendance,,0,S,sols,,,1480,5.475215,48.242538
2021-880453,2021-02-08,000001,Vente,90000,2,,CHE DES JARDINS,0037,52700,52095,Chalvraines,52,,,52095000ZA0085,,,,,,,,,,,,,0,1,Maison,102,5,S,sols,,,1480,5.475215,48.242538
2021-880453,2021-02-08,000001,Vente,90000,2,,CHE DES JARDINS,0037,52700,52095,Chalvraines,52,,,52095000ZA0085,,,,,,,,,,,,,0,3,Dépendance,,0,S,sols,,,1480,5.475215,48.242538
2021-880613,2021-02-26,000001,Vente,156200,2,,RUE DES PUITS,0064,52700,52095,Chalvraines,52,,,520950000D0370,,,,,,,,,,,,,0,1,Maison,207,4,S,sols,,,516,5.480096,48.241323
2021-880613,2021-02-26,000001,Vente,156200,,,VILLAGE,B023,52700,52095,Chalvraines,52,,,520950000D0371,,,,,,,,,,,,,0,,,,,P,prés,,,465,5.480401,48.241258
2021-880613,2021-02-26,000001,Vente,156200,,,VILLAGE,B023,52700,52095,Chalvraines,52,,,520950000D0667,,,,,,,,,,,,,0,,,,,S,sols,,,417,5.480156,48.241196
2021-880613,2021-02-26,000001,Vente,156200,,,VILLAGE,B023,52700,52095,Chalvraines,52,,,520950000D0669,,,,,,,,,,,,,0,,,,,S,sols,,,15,5.479878,48.241167
2021-880792,2021-03-05,000001,Vente,900,,,HAUT DU MOULIN,B014,52700,52095,Chalvraines,52,,,52095000ZB0027,,,,,,,,,,,,,0,,,,,J,jardins,,,430,5.481418,48.242354
2021-881602,2021-05-12,000001,Vente,55000,,,VILLAGE,B023,52700,52095,Chalvraines,52,,,520950000D0562,,,,,,,,,,,,,0,,,,,J,jardins,,,62,5.476274,48.241327
2021-881602,2021-05-12,000001,Vente,55000,4,,RUE DE L EGLISE,0020,52700,52095,Chalvraines,52,,,520950000D0567,,,,,,,,,,,,,0,1,Maison,110,4,S,sols,,,113,5.476219,48.241247
2021-881602,2021-05-12,000001,Vente,55000,,,VILLAGE,B023,52700,52095,Chalvraines,52,,,520950000D0568,,,,,,,,,,,,,0,,,,,L,landes,,,12,5.47615,48.241204
2021-881602,2021-05-12,000001,Vente,55000,,,VILLAGE,B023,52700,52095,Chalvraines,52,,,520950000D0628,,,,,,,,,,,,,0,,,,,S,sols,,,113,5.476351,48.241235
2021-882046,2021-06-29,000001,Vente,25000,,,VILLAGE,B023,52700,52095,Chalvraines,52,,,520950000D0452,,,,,,,,,,,,,0,,,,,S,sols,,,60,5.47803,48.240415
2021-882046,2021-06-29,000001,Vente,25000,15,,RUE DU BOUT NEUF,0007,52700,52095,Chalvraines,52,,,520950000D0453,,,,,,,,,,,,,0,1,Maison,67,2,S,sols,,,621,5.478024,48.240233
2021-882437,2021-07-28,000001,Vente,30000,2,,LA RUELLOTTE,A005,52700,52095,Chalvraines,52,,,520950000D0360,,,,,,,,,,,,,0,1,Maison,89,3,S,sols,,,301,5.479184,48.241442
2021-882793,2021-08-12,000001,Vente,50000,34,,GR GRANDE RUE,0033,52700,52095,Chalvraines,52,,,520950000D0414,,,,,,,,,,,,,0,1,Maison,70,3,S,sols,,,214,5.480579,48.240417
2021-882793,2021-08-12,000001,Vente,50000,34,,GR GRANDE RUE,0033,52700,52095,Chalvraines,52,,,520950000D0414,,,,,,,,,,,,,0,3,Dépendance,,0,S,sols,,,214,5.480579,48.240417
2021-883381,2021-09-06,000001,Vente,1632.4,,,HAUT DU MOULIN,B014,52700,52095,Chalvraines,52,,,52095000ZB0122,,,,,,,,,,,,,0,,,,,P,prés,,,1362,5.483778,48.241211
2021-883382,2021-09-06,000001,Vente,1101.6,,,HAUT DU MOULIN,B014,52700,52095,Chalvraines,52,,,52095000ZB0121,,,,,,,,,,,,,0,,,,,P,prés,,,918,5.483428,48.241361
2021-883630,2021-11-02,000001,Vente,4500,7,,RUE DU JEU DE PAUME,0040,52700,52095,Chalvraines,52,,,520950000D0497,,,,,,,,,,,,,0,1,Maison,120,3,S,sols,,,191,5.478125,48.240931
2021-883630,2021-11-02,000001,Vente,4500,,,VILLAGE,B023,52700,52095,Chalvraines,52,,,520950000D0500,,,,,,,,,,,,,0,,,,,J,jardins,,,126,5.478116,48.240667
2021-883630,2021-11-02,000001,Vente,4500,,,VILLAGE,B023,52700,52095,Chalvraines,52,,,520950000D0509,,,,,,,,,,,,,0,,,,,L,landes,,,8,5.477943,48.240905
2021-884206,2021-11-30,000001,Vente,40100,,,HAUT DU MOULIN,B014,52700,52095,Chalvraines,52,,,52095000ZB0055,,,,,,,,,,,,,0,,,,,J,jardins,,,750,5.480414,48.242887
2021-884206,2021-11-30,000001,Vente,40100,29,,GR GRANDE RUE,0033,52700,52095,Chalvraines,52,,,52095000ZB0079,,,,,,,,,,,,,0,1,Maison,120,3,S,sols,,,1080,5.479327,48.241304
2021-884206,2021-11-30,000001,Vente,40100,,,COMBE LA BOUTEILLE,B007,52700,52095,Chalvraines,52,,,52095000ZC0001,,,,,,,,,,,,,0,,,,,S,sols,,,290,5.490203,48.242844
