id_mutation,date_mutation,numero_disposition,nature_mutation,valeur_fonciere,adresse_numero,adresse_suffixe,adresse_nom_voie,adresse_code_voie,code_postal,code_commune,nom_commune,code_departement,ancien_code_commune,ancien_nom_commune,id_parcelle,ancien_id_parcelle,numero_volume,lot1_numero,lot1_surface_carrez,lot2_numero,lot2_surface_carrez,lot3_numero,lot3_surface_carrez,lot4_numero,lot4_surface_carrez,lot5_numero,lot5_surface_carrez,nombre_lots,code_type_local,type_local,surface_reelle_bati,nombre_pieces_principales,code_nature_culture,nature_culture,code_nature_culture_speciale,nature_culture_speciale,surface_terrain,longitude,latitude
2021-880335,2021-02-09,000001,Vente,450,,,PLANCOURT,B046,52400,52135,Coiffy-le-Bas,52,,,521350000A0620,,,,,,,,,,,,,0,,,,,VI,vignes,,,670,5.658488,47.909451
2021-880335,2021-02-09,000001,Vente,450,,,LES MAILLOTTES,B039,52400,52135,Coiffy-le-Bas,52,,,521350000C0122,,,,,,,,,,,,,0,,,,,BS,taillis sous futaie,,,1277,5.675695,47.907061
2021-880335,2021-02-09,000001,Vente,450,,,LES MAILLOTTES,B039,52400,52135,Coiffy-le-Bas,52,,,521350000C0123,,,,,,,,,,,,,0,,,,,BT,taillis simples,,,830,5.67549,47.906921
2021-880335,2021-02-09,000001,Vente,450,,,LES MAILLOTTES,B039,52400,52135,Coiffy-le-Bas,52,,,521350000C0140,,,,,,,,,,,,,0,,,,,BT,taillis simples,,,624,5.674987,47.907047
2021-880335,2021-02-09,000001,Vente,450,,,LES MAILLOTTES,B039,52400,52135,Coiffy-le-Bas,52,,,521350000C0141,,,,,,,,,,,,,0,,,,,BT,taillis simples,,,634,5.675062,47.907166
2021-880336,2021-02-09,000001,Vente,600,,,LE MONTIGNY,B042,52400,52135,Coiffy-le-Bas,52,,,521350000A0775,,,,,,,,,,,,,0,,,,,L,landes,,,738,5.66584,47.913291
2021-880336,2021-02-09,000001,Vente,600,,,LE MONTIGNY,B042,52400,52135,Coiffy-le-Bas,52,,,521350000A0778,,,,,,,,,,,,,0,,,,,L,landes,,,702,5.666084,47.913469
2021-880336,2021-02-09,000001,Vente,600,,,LE MONTIGNY,B042,52400,52135,Coiffy-le-Bas,52,,,521350000A0795,,,,,,,,,,,,,0,,,,,BT,taillis simples,,,507,5.667056,47.914692
2021-880336,2021-02-09,000001,Vente,600,,,LE MONTIGNY,B042,52400,52135,Coiffy-le-Bas,52,,,521350000A0842,,,,,,,,,,,,,0,,,,,L,landes,,,423,5.668314,47.913343
2021-880336,2021-02-09,000001,Vente,600,,,LE MONTIGNY,B042,52400,52135,Coiffy-le-Bas,52,,,521350000A0860,,,,,,,,,,,,,0,,,,,L,landes,,,171,5.667261,47.91247
2021-880341,2021-02-09,000001,Vente,300,,,DEVANT LES SEULX,B023,52400,52135,Coiffy-le-Bas,52,,,521350000C0168,,,,,,,,,,,,,0,,,,,P,prés,,,1161,5.674769,47.911135
2021-880513,2021-02-25,000001,Vente,13000,13,,RUE DU COIN,0040,52400,52135,Coiffy-le-Bas,52,,,521350000E0309,,,,,,,,,,,,,0,1,Maison,130,5,S,sols,,,387,5.675588,47.912058
2021-880513,2021-02-25,000001,Vente,13000,,,VILLAGE,B074,52400,52135,Coiffy-le-Bas,52,,,521350000E0311,,,,,,,,,,,,,0,,,,,J,jardins,,,654,5.675633,47.911956
2021-880513,2021-02-25,000001,Vente,13000,,,VILLAGE,B074,52400,52135,Coiffy-le-Bas,52,,,521350000E0330,,,,,,,,,,,,,0,,,,,S,sols,,,56,5.675417,47.912093
2021-880681,2021-03-19,000001,Vente,22600,,,CORVEE AUX DAMES,B013,52400,52135,Coiffy-le-Bas,52,,,521350000A0010,,,,,,,,,,,,,0,,,,,P,prés,,,2221,5.640035,47.909102
2021-880681,2021-03-19,000001,Vente,22600,,,CORVEE AUX DAMES,B013,52400,52135,Coiffy-le-Bas,52,,,521350000A0012,,,,,,,,,,,,,0,,,,,P,prés,,,7204,5.641833,47.908088
2021-881399,2021-05-20,000001,Vente,38000,12,,RUE DE LA CHAPELLE,0020,52400,52135,Coiffy-le-Bas,52,,,521350000E0116,,,,,,,,,,,,,0,1,Maison,100,3,S,sols,,,522,5.678579,47.913789
2021-881399,2021-05-20,000001,Vente,38000,,,VILLAGE,B074,52400,52135,Coiffy-le-Bas,52,,,521350000E0117,,,,,,,,,,,,,0,,,,,T,terres,,,950,5.678435,47.913612
2021-881399,2021-05-20,000001,Vente,38000,,,VILLAGE,B074,52400,52135,Coiffy-le-Bas,52,,,521350000E0118,,,,,,,,,,,,,0,,,,,P,prés,,,593,5.677994,47.91349
2021-881399,2021-05-20,000001,Vente,38000,,,VILLAGE,B074,52400,52135,Coiffy-le-Bas,52,,,521350000E0119,,,,,,,,,,,,,0,,,,,VE,vergers,,,171,5.678235,47.913727
2021-881399,2021-05-20,000001,Vente,38000,,,VILLAGE,B074,52400,52135,Coiffy-le-Bas,52,,,521350000E0127,,,,,,,,,,,,,0,,,,,P,prés,,,1522,5.677741,47.913323
2021-881421,2021-01-30,000001,Vente,51000,48,,RUE DU COIN,0040,52400,52135,Coiffy-le-Bas,52,,,521350000E0173,,,,,,,,,,,,,0,1,Maison,69,2,S,sols,,,112,5.675212,47.912233
2021-881421,2021-01-30,000001,Vente,51000,,,VILLAGE,B074,52400,52135,Coiffy-le-Bas,52,,,521350000E0174,,,,,,,,,,,,,0,,,,,J,jardins,,,456,5.674898,47.912353
2021-881432,2021-05-21,000001,Echange,200,,,LAMILLION,B037,52400,52135,Coiffy-le-Bas,52,,,521350000A0914,,,,,,,,,,,,,0,,,,,BS,taillis sous futaie,,,768,5.667608,47.91961
2021-881833,2021-06-25,000001,Vente,34000,,,TRANCHEQUEUE,B073,52400,52135,Coiffy-le-Bas,52,,,521350000D0111,,,,,,,,,,,,,0,,,,,L,landes,,,129175,5.643856,47.904023
2021-881833,2021-06-25,000001,Vente,34000,,,TRANCHEQUEUE,B073,52400,52135,Coiffy-le-Bas,52,,,521350000D0111,,,,,,,,,,,,,0,,,,,B,bois,,,32293,5.643856,47.904023
2021-881867,2021-06-24,000001,Vente,18500,,,VILLAGE,B074,52400,52135,Coiffy-le-Bas,52,,,521350000E0158,,,,,,,,,,,,,0,,,,,P,prés,,,544,5.676038,47.912515
2021-881867,2021-06-24,000001,Vente,18500,36,,RUE DU COIN,0040,52400,52135,Coiffy-le-Bas,52,,,521350000E0187,,,,,,,,,,,,,0,1,Maison,63,2,S,sols,,,613,5.675461,47.912637
2021-881869,2021-06-24,000001,Vente,1844,,,VILLAGE,B074,52400,52135,Coiffy-le-Bas,52,,,521350000E0091,,,,,,,,,,,,,0,,,,,L,landes,,,242,5.678192,47.911447
2021-881869,2021-06-24,000001,Vente,1844,,,VILLAGE,B074,52400,52135,Coiffy-le-Bas,52,,,521350000E0093,,,,,,,,,,,,,0,,,,,VE,vergers,,,462,5.677798,47.911483
2021-882150,2021-07-06,000001,Vente,13000,,,DESSOUS RONCHOUX,B020,52400,52135,Coiffy-le-Bas,52,,,521350000B0382,,,,,,,,,,,,,0,,,,,VE,vergers,,,299,5.688066,47.920857
2021-882150,2021-07-06,000001,Vente,13000,,,DESSOUS RONCHOUX,B020,52400,52135,Coiffy-le-Bas,52,,,521350000B0383,,,,,,,,,,,,,0,,,,,L,landes,,,451,5.688275,47.920714
2021-882150,2021-07-06,000001,Vente,13000,17,,RUE DU COIN,0040,52400,52135,Coiffy-le-Bas,52,,,521350000C0167,,,,,,,,,,,,,0,1,Maison,40,2,S,sols,,,438,5.674783,47.911444
2021-882150,2021-07-06,000001,Vente,13000,,,ENTRE LES DEUX MOULINS,B025,52400,52135,Coiffy-le-Bas,52,,,521350000D0375,,,,,,,,,,,,,0,,,,,L,landes,,,696,5.670002,47.911186
2021-882162,2021-07-09,000001,Vente,50500,6,,RUE DU COIN,0040,52400,52135,Coiffy-le-Bas,52,,,521350000E0212,,,,,,,,,,,,,0,1,Maison,86,3,S,sols,,,221,5.677197,47.914149
2021-882162,2021-07-09,000001,Vente,50500,,,VILLAGE,B074,52400,52135,Coiffy-le-Bas,52,,,521350000E0213,,,,,,,,,,,,,0,,,,,J,jardins,,,527,5.676827,47.914275
2021-882353,2021-07-26,000001,Vente,54557,,,CORVEE AUX DAMES,B013,52400,52135,Coiffy-le-Bas,52,,,521350000A0010,,,,,,,,,,,,,0,,,,,P,prés,,,2221,5.640035,47.909102
2021-882353,2021-07-26,000001,Vente,54557,,,CORVEE AUX DAMES,B013,52400,52135,Coiffy-le-Bas,52,,,521350000A0012,,,,,,,,,,,,,0,,,,,P,prés,,,7204,5.641833,47.908088
2021-882359,2021-07-16,000001,Vente,1692,,,PETIT GRAVIER,B045,52400,52135,Coiffy-le-Bas,52,,,521350000A0163,,,,,,,,,,,,,0,,,,,P,prés,,,5748,5.653591,47.909571
2021-882359,2021-07-16,000001,Vente,1692,,,PRE MAROISE,B055,52400,52135,Coiffy-le-Bas,52,,,521350000D0150,,,,,,,,,,,,,0,,,,,P,prés,,,1020,5.647392,47.900522
2021-882434,2021-07-30,000001,Vente,320,,,PLANCOURT,B046,52400,52135,Coiffy-le-Bas,52,,,521350000A0670,,,,,,,,,,,,,0,,,,,VE,vergers,,,1562,5.656346,47.911278
