id_mutation,date_mutation,numero_disposition,nature_mutation,valeur_fonciere,adresse_numero,adresse_suffixe,adresse_nom_voie,adresse_code_voie,code_postal,code_commune,nom_commune,code_departement,ancien_code_commune,ancien_nom_commune,id_parcelle,ancien_id_parcelle,numero_volume,lot1_numero,lot1_surface_carrez,lot2_numero,lot2_surface_carrez,lot3_numero,lot3_surface_carrez,lot4_numero,lot4_surface_carrez,lot5_numero,lot5_surface_carrez,nombre_lots,code_type_local,type_local,surface_reelle_bati,nombre_pieces_principales,code_nature_culture,nature_culture,code_nature_culture_speciale,nature_culture_speciale,surface_terrain,longitude,latitude
2021-880092,2021-01-13,000001,Vente,38340,,,SENTIER DU CORGEBIN,B116,52000,52469,Semoutiers-Montsaon,52,,,52469000ZP0015,,,,,,,,,,,,,0,,,,,T,terres,,,2260,5.065304,48.061609
2021-880092,2021-01-13,000001,Vente,38340,,,SENTIER DU CORGEBIN,B116,52000,52469,Semoutiers-Montsaon,52,,,52469000ZP0016,,,,,,,,,,,,,0,,,,,T,terres,,,14567,5.067656,48.061314
2021-880092,2021-01-13,000001,Vente,38340,,,SENTIER DU CORGEBIN,B116,52000,52469,Semoutiers-Montsaon,52,,,52469000ZP0016,,,,,,,,,,,,,0,,,,,T,terres,,,29133,5.067656,48.061314
2021-880092,2021-01-13,000001,Vente,38340,,,SENTIER DU CORGEBIN,B116,52000,52469,Semoutiers-Montsaon,52,,,52469000ZP0022,,,,,,,,,,,,,0,,,,,T,terres,,,3924,5.071939,48.070198
2021-880092,2021-01-13,000001,Vente,38340,,,SENTIER DU CORGEBIN,B116,52000,52469,Semoutiers-Montsaon,52,,,52469000ZP0022,,,,,,,,,,,,,0,,,,,T,terres,,,35316,5.071939,48.070198
2021-880123,2021-01-21,000002,Vente terrain à bâtir,141000,,,LA CHAUX EST,B032,52000,52469,Semoutiers-Montsaon,52,,,52469000ZX0137,,,,,,,,,,,,,0,,,,,L,landes,FRICH,Friche,6000,5.067593,48.037238
2021-880409,2021-02-10,000001,Vente,190000,8,,RUE DE LA MALADIERE,0060,52000,52469,Semoutiers-Montsaon,52,,,52469000AE0370,,,,,,,,,,,,,0,1,Maison,107,4,P,prés,,,789,5.055599,48.057004
2021-880409,2021-02-10,000001,Vente,190000,8,,RUE DE LA MALADIERE,0060,52000,52469,Semoutiers-Montsaon,52,,,52469000AE0370,,,,,,,,,,,,,0,1,Maison,107,4,S,sols,,,666,5.055599,48.057004
2021-880886,2021-03-23,000001,Vente,170000,,,SUR LA PERRIERE,B093,52000,52469,Semoutiers-Montsaon,52,,,52469000AE0237,,,,,,,,,,,,,0,,,,,J,jardins,,,344,5.05352,48.061117
2021-880886,2021-03-23,000001,Vente,170000,,,SUR LA PERRIERE,B093,52000,52469,Semoutiers-Montsaon,52,,,52469000AE0237,,,,,,,,,,,,,0,,,,,S,sols,,,286,5.05352,48.061117
2021-880886,2021-03-23,000001,Vente,170000,,,SUR LA PERRIERE,B093,52000,52469,Semoutiers-Montsaon,52,,,52469000AE0266,,,,,,,,,,,,,0,,,,,P,prés,,,36,5.05332,48.060924
2021-880886,2021-03-23,000001,Vente,170000,7,,RUE DE MONTSAON,0065,52000,52469,Semoutiers-Montsaon,52,,,52469000YC0037,,,,,,,,,,,,,0,1,Maison,124,6,J,jardins,,,428,5.053276,48.061253
2021-880886,2021-03-23,000001,Vente,170000,7,,RUE DE MONTSAON,0065,52000,52469,Semoutiers-Montsaon,52,,,52469000YC0037,,,,,,,,,,,,,0,1,Maison,124,6,S,sols,,,942,5.053276,48.061253
2021-880886,2021-03-23,000001,Vente,170000,,,LA FAVIERE,B059,52000,52469,Semoutiers-Montsaon,52,,,52469000YC0038,,,,,,,,,,,,,0,,,,,P,prés,,,42,5.053138,48.060956
2021-881028,2021-04-07,000001,Vente,35500,,,LE VILLAGE,B143,52000,52469,Semoutiers-Montsaon,52,,,52469000AE0365,,,,,,,,,,,,,0,,,,,P,prés,,,1420,5.060643,48.060165
2021-881391,2021-04-30,000001,Vente,4736,,,VIEUX MARCHAT,B141,52000,52469,Semoutiers-Montsaon,52,,,52469339YI0035,,,,,,,,,,,,,0,,,,,P,prés,,,8008,5.032394,48.087405
2021-881391,2021-04-30,000001,Vente,4736,,,VIEUX MARCHAT,B141,52000,52469,Semoutiers-Montsaon,52,,,52469339YI0035,,,,,,,,,,,,,0,,,,,P,prés,,,1735,5.032394,48.087405
2021-881391,2021-04-30,000001,Vente,4736,,,VIEUX MARCHAT,B141,52000,52469,Semoutiers-Montsaon,52,,,52469339YI0035,,,,,,,,,,,,,0,,,,,P,prés,,,6045,5.032394,48.087405
2021-881424,2021-05-12,000001,Vente,89000,10,,RUE DE NEUILLY,0070,52000,52469,Semoutiers-Montsaon,52,,,52469000AE0203,,,,,,,,,,,,,0,1,Maison,93,3,S,sols,,,518,5.058774,48.059083
2021-881424,2021-05-12,000001,Vente,89000,,,LE VILLAGE,B143,52000,52469,Semoutiers-Montsaon,52,,,52469000AE0212,,,,,,,,,,,,,0,,,,,S,sols,,,84,5.058882,48.059116
2021-881884,2021-06-23,000001,Vente,27000,,,VAL BOISSENOT,B127,52000,52469,Semoutiers-Montsaon,52,,,52469000ZN0017,,,,,,,,,,,,,0,,,,,T,terres,,,1360,5.060159,48.062913
2021-882642,2021-07-27,000001,Vente,50000,8,,GR GRANDE RUE,0030,52000,52469,Semoutiers-Montsaon,52,,,52469000AE0136,,,,,,,,,,,,,0,1,Maison,140,4,S,sols,,,267,5.056312,48.059288
2021-882642,2021-07-27,000001,Vente,50000,,,LE VILLAGE,B143,52000,52469,Semoutiers-Montsaon,52,,,52469000AE0325,,,,,,,,,,,,,0,,,,,J,jardins,,,174,5.056128,48.059465
2021-882642,2021-07-27,000001,Vente,50000,,,LE VILLAGE,B143,52000,52469,Semoutiers-Montsaon,52,,,52469000AE0326,,,,,,,,,,,,,0,,,,,S,sols,,,20,5.056243,48.059512
2021-882791,2021-08-06,000001,Vente,6480,,,LE VILLAGE,B143,52000,52469,Semoutiers-Montsaon,52,,,52469000AE0160,,,,,,,,,,,,,0,,,,,L,landes,FRICH,Friche,25,5.05683,48.057868
2021-882791,2021-08-06,000001,Vente,6480,,,LE VILLAGE,B143,52000,52469,Semoutiers-Montsaon,52,,,52469000AE0163,,,,,,,,,,,,,0,,,,,P,prés,,,1405,5.057507,48.05741
2021-882791,2021-08-06,000001,Vente,6480,,,LE VILLAGE,B143,52000,52469,Semoutiers-Montsaon,52,,,52469000AE0166,,,,,,,,,,,,,0,,,,,P,prés,,,1003,5.056886,48.056828
2021-882815,2021-08-11,000001,Vente,153500,2,,RUE JEAN MOULIN,0040,52000,52469,Semoutiers-Montsaon,52,,,52469000AE0254,,,,,,,,,,,,,0,1,Maison,82,5,S,sols,,,677,5.054941,48.057736
2021-882847,2021-08-09,000001,Vente,197000,,,MONTSAON,B144,52000,52469,Semoutiers-Montsaon,52,,,524693390C0483,,,,,,,,,,,,,0,,,,,J,jardins,,,661,5.034643,48.084768
2021-882847,2021-08-09,000001,Vente,197000,1,,CHE DE LA CORVEE A MONTSAON,0100,52000,52469,Semoutiers-Montsaon,52,,,524693390C0484,,,,,,,,,,,,,0,1,Maison,155,7,S,sols,,,2011,5.035057,48.084624
2021-882847,2021-08-09,000001,Vente,197000,,,MONTSAON,B144,52000,52469,Semoutiers-Montsaon,52,,,524693390C0654,,,,,,,,,,,,,0,,,,,VE,vergers,,,21,5.034956,48.084297
2021-882847,2021-08-09,000001,Vente,197000,,,MONTSAON,B144,52000,52469,Semoutiers-Montsaon,52,,,524693390C0657,,,,,,,,,,,,,0,,,,,S,sols,,,106,5.035236,48.084014
2021-882847,2021-08-09,000001,Vente,197000,,,MONTSAON,B144,52000,52469,Semoutiers-Montsaon,52,,,524693390C0658,,,,,,,,,,,,,0,,,,,S,sols,,,3,5.03502,48.084241
2021-882847,2021-08-09,000001,Vente,197000,,,MONTSAON,B144,52000,52469,Semoutiers-Montsaon,52,,,524693390C0660,,,,,,,,,,,,,0,,,,,S,sols,,,964,5.03524,48.084435
2021-882847,2021-08-09,000001,Vente,197000,,,MONTSAON,B144,52000,52469,Semoutiers-Montsaon,52,,,524693390C0663,,,,,,,,,,,,,0,,,,,S,sols,,,21,5.035273,48.084075
2021-882847,2021-08-09,000001,Vente,197000,,,MONTSAON,B144,52000,52469,Semoutiers-Montsaon,52,,,524693390C0664,,,,,,,,,,,,,0,,,,,S,sols,,,93,5.0351,48.084207
2021-882847,2021-08-09,000001,Vente,197000,,,MONTSAON,B144,52000,52469,Semoutiers-Montsaon,52,,,524693390C0669,,,,,,,,,,,,,0,,,,,VE,vergers,,,1184,5.034656,48.084461
2021-883583,2021-10-27,000001,Vente,,,,LA CHAUX EST,B032,52000,52469,Semoutiers-Montsaon,52,,,52469000ZX0120,,,,,,,,,,,,,0,,,,,S,sols,,,30,5.07626,48.03455
2021-883583,2021-10-27,000001,Vente,,,,LA CHAUX EST,B032,52000,52469,Semoutiers-Montsaon,52,,,52469000ZX0122,,,,,,,,,,,,,0,,,,,S,sols,,,46,5.075439,48.032786
2021-883583,2021-10-27,000001,Vente,,,,LA CHAUX EST,B032,52000,52469,Semoutiers-Montsaon,52,,,52469000ZX0123,,,,,,,,,,,,,0,,,,,S,sols,,,265,5.075152,48.032596
2021-883583,2021-10-27,000001,Vente,,,,LA CHAUX EST,B032,52000,52469,Semoutiers-Montsaon,52,,,52469000ZX0128,,,,,,,,,,,,,0,,,,,S,sols,,,18,5.076457,48.033625
2021-883583,2021-10-27,000001,Vente,,,,LA CHAUX EST,B032,52000,52469,Semoutiers-Montsaon,52,,,52469000ZX0129,,,,,,,,,,,,,0,,,,,S,sols,,,272,5.075731,48.032993
2021-883583,2021-10-27,000001,Vente,,,,LA CHAUX EST,B032,52000,52469,Semoutiers-Montsaon,52,,,52469000ZX0131,,,,,,,,,,,,,0,,,,,S,sols,,,3562,5.076323,48.033809
2021-883583,2021-10-27,000001,Vente,,,,LA CHAUX EST,B032,52000,52469,Semoutiers-Montsaon,52,,,52469000ZX0136,,,,,,,,,,,,,0,,,,,S,sols,,,835,5.076226,48.035585
2021-883655,2021-10-20,000001,Vente,240000,1,,ALL DU CORGEBIN,0017,52000,52469,Semoutiers-Montsaon,52,,,52469000ZP0010,,,,,,,,,,,,,0,1,Maison,145,6,S,sols,,,1470,5.062337,48.061749
2021-883655,2021-10-20,000001,Vente,240000,1,,ALL DU CORGEBIN,0017,52000,52469,Semoutiers-Montsaon,52,,,52469000ZP0010,,,,,,,,,,,,,0,1,Maison,145,6,J,jardins,,,1410,5.062337,48.061749
2021-884448,2021-12-28,000001,Vente,29000,,,LE COLOMBIER,B037,52000,52469,Semoutiers-Montsaon,52,,,52469000ZV0057,,,,,,,,,,,,,0,,,,,S,sols,,,911,5.062738,48.060642
