id_mutation,date_mutation,numero_disposition,nature_mutation,valeur_fonciere,adresse_numero,adresse_suffixe,adresse_nom_voie,adresse_code_voie,code_postal,code_commune,nom_commune,code_departement,ancien_code_commune,ancien_nom_commune,id_parcelle,ancien_id_parcelle,numero_volume,lot1_numero,lot1_surface_carrez,lot2_numero,lot2_surface_carrez,lot3_numero,lot3_surface_carrez,lot4_numero,lot4_surface_carrez,lot5_numero,lot5_surface_carrez,nombre_lots,code_type_local,type_local,surface_reelle_bati,nombre_pieces_principales,code_nature_culture,nature_culture,code_nature_culture_speciale,nature_culture_speciale,surface_terrain,longitude,latitude
2021-881458,2021-05-07,000001,Vente,42000,,,LE BAS VILLAGE,B009,52800,52488,Thivet,52,,,524880000D0565,,,,,,,,,,,,,0,,,,,S,sols,,,14,5.286808,47.991977
2021-881458,2021-05-07,000001,Vente,42000,25,,RUE PRINCIPALE,0037,52800,52488,Thivet,52,,,524880000D0566,,,,,,,,,,,,,0,1,Maison,118,4,S,sols,,,380,5.286802,47.991895
2021-881458,2021-05-07,000001,Vente,42000,,,LE BAS VILLAGE,B009,52800,52488,Thivet,52,,,524880000D0568,,,,,,,,,,,,,0,,,,,S,sols,,,22,5.286785,47.991699
2021-882514,2021-07-29,000001,Vente,127500,55,,RUE PRINCIPALE,0037,52800,52488,Thivet,52,,,524880000D0170,,,,,,,,,,,,,0,1,Maison,180,5,S,sols,,,1087,5.29221,47.992214
2021-882514,2021-07-29,000001,Vente,127500,55,,RUE PRINCIPALE,0037,52800,52488,Thivet,52,,,524880000D0171,,,,,,,,,,,,,0,3,Dépendance,,0,P,prés,,,1990,5.292118,47.992608
2021-882514,2021-07-29,000001,Vente,127500,55,,RUE PRINCIPALE,0037,52800,52488,Thivet,52,,,524880000D0171,,,,,,,,,,,,,0,3,Dépendance,,0,P,prés,,,1990,5.292118,47.992608
2021-883282,2021-09-20,000001,Vente,4000,,,LE HAUT VILLAGE,B128,52800,52488,Thivet,52,,,524880000D0290,,,,,,,,,,,,,0,,,,,VE,vergers,,,475,5.292965,47.990934
2021-883282,2021-09-20,000001,Vente,4000,,,LE HAUT VILLAGE,B128,52800,52488,Thivet,52,,,524880000D0416,,,,,,,,,,,,,0,,,,,S,sols,,,235,5.292902,47.99098
2021-883332,2021-09-21,000001,Vente,8500,,,LE HAUT VILLAGE,B128,52800,52488,Thivet,52,,,524880000D0155,,,,,,,,,,,,,0,,,,,J,jardins,,,589,5.290378,47.992457
2021-883332,2021-09-21,000001,Vente,8500,6,,RUE DE LETTRES,0022,52800,52488,Thivet,52,,,524880000D0156,,,,,,,,,,,,,0,1,Maison,90,2,S,sols,,,274,5.290248,47.992152
