id_mutation,date_mutation,numero_disposition,nature_mutation,valeur_fonciere,adresse_numero,adresse_suffixe,adresse_nom_voie,adresse_code_voie,code_postal,code_commune,nom_commune,code_departement,ancien_code_commune,ancien_nom_commune,id_parcelle,ancien_id_parcelle,numero_volume,lot1_numero,lot1_surface_carrez,lot2_numero,lot2_surface_carrez,lot3_numero,lot3_surface_carrez,lot4_numero,lot4_surface_carrez,lot5_numero,lot5_surface_carrez,nombre_lots,code_type_local,type_local,surface_reelle_bati,nombre_pieces_principales,code_nature_culture,nature_culture,code_nature_culture_speciale,nature_culture_speciale,surface_terrain,longitude,latitude
2021-886678,2021-04-02,000001,Vente,46810,1,,PL DU LAVOIR,0080,53290,53027,Beaumont-Pied-de-Bœuf,53,,,530270000B0081,,,,,,,,,,,,,0,1,Maison,95,3,S,sols,,,112,-0.433501,47.904914
2021-887464,2021-05-04,000001,Vente,149000,2,,RUE GOUGEON DE LUCE,0050,53290,53027,Beaumont-Pied-de-Bœuf,53,,,530270000B0670,,,,,,,,,,,,,0,1,Maison,182,9,S,sols,,,639,-0.432524,47.905121
2021-887464,2021-05-04,000001,Vente,149000,,,LE BOURG,B029,53290,53027,Beaumont-Pied-de-Bœuf,53,,,530270000B0689,,,,,,,,,,,,,0,,,,,VE,vergers,POMME,Pommiers,478,-0.432512,47.905346
2021-888364,2021-06-01,000001,Vente,20000,,,LA CHAUMINETTE,B103,53290,53027,Beaumont-Pied-de-Bœuf,53,,,530270000B0635,,,,,,,,,,,,,0,,,,,S,sols,,,5001,-0.435715,47.899686
2021-889866,2021-07-30,000001,Vente,26500,,,LE VERGER,B528,53290,53027,Beaumont-Pied-de-Bœuf,53,,,530270000A0129,,,,,,,,,,,,,0,,,,,VE,vergers,POMME,Pommiers,1180,-0.449224,47.928883
2021-889866,2021-07-30,000001,Vente,26500,,,LE GRAND JARDIN,B184,53290,53027,Beaumont-Pied-de-Bœuf,53,,,530270000A0142,,,,,,,,,,,,,0,,,,,T,terres,,,2953,-0.447421,47.928477
2021-889866,2021-07-30,000001,Vente,26500,,,LA PINSONNERIE,B407,53290,53027,Beaumont-Pied-de-Bœuf,53,,,530270000A0143,,,,,,,,,,,,,0,,,,,S,sols,,,285,-0.447258,47.928394
2021-889866,2021-07-30,000001,Vente,26500,,,LE JARDIN,B248,53290,53027,Beaumont-Pied-de-Bœuf,53,,,530270000A0144,,,,,,,,,,,,,0,,,,,J,jardins,,,706,-0.447326,47.928195
2021-889866,2021-07-30,000001,Vente,26500,,,LA GRANDE MORAIS,B207,53290,53027,Beaumont-Pied-de-Bœuf,53,,,530270000A0145,,,,,,,,,,,,,0,,,,,T,terres,,,7140,-0.446389,47.928156
2021-889866,2021-07-30,000001,Vente,26500,,,LE VERGER DE LA PINSONNERI,B538,53290,53027,Beaumont-Pied-de-Bœuf,53,,,530270000A0146,,,,,,,,,,,,,0,,,,,T,terres,,,1930,-0.446317,47.928666
2021-889866,2021-07-30,000001,Vente,26500,,,LE CLOSEAU AUX RONCES,B122,53290,53027,Beaumont-Pied-de-Bœuf,53,,,530270000A0147,,,,,,,,,,,,,0,,,,,T,terres,,,3190,-0.446139,47.929011
2021-889866,2021-07-30,000001,Vente,26500,,,LE PRE DU MOULIN,B472,53290,53027,Beaumont-Pied-de-Bœuf,53,,,530270000A0470,,,,,,,,,,,,,0,,,,,P,prés,,,7500,-0.449487,47.928457
2021-889866,2021-07-30,000001,Vente,26500,,,LA GRANDE MORAIS,B207,53290,53027,Beaumont-Pied-de-Bœuf,53,,,530270000A0520,,,,,,,,,,,,,0,,,,,T,terres,,,588,-0.446688,47.927913
2021-889866,2021-07-30,000001,Vente,26500,,,LA PIECE BLIN,B368,53290,53027,Beaumont-Pied-de-Bœuf,53,,,530270000A0651,,,,,,,,,,,,,0,,,,,T,terres,,,938,-0.447277,47.928825
2021-889866,2021-07-30,000001,Vente,26500,,,LE CLOSEAU DE LA MONNERIE,B130,53290,53027,Beaumont-Pied-de-Bœuf,53,,,530270000A0653,,,,,,,,,,,,,0,,,,,T,terres,,,402,-0.446879,47.928716
2021-889866,2021-07-30,000001,Vente,26500,,,LA BLINIERE,B018,53290,53027,Beaumont-Pied-de-Bœuf,53,,,530270000A0655,,,,,,,,,,,,,0,,,,,P,prés,,,10459,-0.448218,47.928552
2021-892033,2021-10-15,000002,Vente,488752,,,LE GRAND PRE,B187,53290,53027,Beaumont-Pied-de-Bœuf,53,,,530270000B0145,,,,,,,,,,,,,0,,,,,P,prés,,,33970,-0.427248,47.909655
2021-892033,2021-10-15,000002,Vente,488752,,,LA PETITE LONGUERAIE,B346,53290,53027,Beaumont-Pied-de-Bœuf,53,,,530270000B0159,,,,,,,,,,,,,0,,,,,T,terres,,,17405,-0.423827,47.915715
2021-892033,2021-10-15,000002,Vente,488752,,,LE CHAMP DE FONTAINE,B056,53290,53027,Beaumont-Pied-de-Bœuf,53,,,530270000B0160,,,,,,,,,,,,,0,,,,,P,prés,,,36520,-0.423022,47.914345
2021-892033,2021-10-15,000002,Vente,488752,,,LE PRE DE NOE FONTAINE,B457,53290,53027,Beaumont-Pied-de-Bœuf,53,,,530270000B0161,,,,,,,,,,,,,0,,,,,VE,vergers,POMME,Pommiers,2050,-0.42417,47.9131
2021-892033,2021-10-15,000002,Vente,488752,,,LE PRE DE NOE FONTAINE,B457,53290,53027,Beaumont-Pied-de-Bœuf,53,,,530270000B0162,,,,,,,,,,,,,0,,,,,P,prés,,,5090,-0.423759,47.912462
2021-892033,2021-10-15,000002,Vente,488752,,,LE PRE DU ROCHER,B476,53290,53027,Beaumont-Pied-de-Bœuf,53,,,530270000B0163,,,,,,,,,,,,,0,,,,,P,prés,,,9245,-0.423932,47.911156
2021-892033,2021-10-15,000002,Vente,488752,,,LE ROCHER,B498,53290,53027,Beaumont-Pied-de-Bœuf,53,,,530270000B0164,,,,,,,,,,,,,0,,,,,P,prés,,,23710,-0.422624,47.912223
2021-892033,2021-10-15,000002,Vente,488752,,,LE CHEMIN,B114,53290,53027,Beaumont-Pied-de-Bœuf,53,,,530270000B0165,,,,,,,,,,,,,0,,,,,T,terres,,,1700,-0.422865,47.913345
2021-892033,2021-10-15,000002,Vente,488752,,,LE JARDIN,B248,53290,53027,Beaumont-Pied-de-Bœuf,53,,,530270000B0167,,,,,,,,,,,,,0,,,,,J,jardins,,,1435,-0.421508,47.914422
2021-892033,2021-10-15,000002,Vente,488752,,,LA NOE DE LA MARE,B288,53290,53027,Beaumont-Pied-de-Bœuf,53,,,530270000B0168,,,,,,,,,,,,,0,,,,,VE,vergers,POMME,Pommiers,3545,-0.421978,47.914741
2021-892033,2021-10-15,000002,Vente,488752,,,CLOSEAU DE LA LONGUERAIE,B128,53290,53027,Beaumont-Pied-de-Bœuf,53,,,530270000B0169,,,,,,,,,,,,,0,,,,,P,prés,,,5260,-0.42251,47.915606
2021-892033,2021-10-15,000002,Vente,488752,,,LA GRANDE LONGUERAIE,B206,53290,53027,Beaumont-Pied-de-Bœuf,53,,,530270000B0170,,,,,,,,,,,,,0,,,,,T,terres,,,18625,-0.422622,47.916924
2021-892033,2021-10-15,000002,Vente,488752,,,LE PRE DE L AIRE,B434,53290,53027,Beaumont-Pied-de-Bœuf,53,,,530270000B0172,,,,,,,,,,,,,0,,,,,P,prés,,,13535,-0.420238,47.915625
2021-892033,2021-10-15,000002,Vente,488752,,,LE CHAMP DES JARRIAIS DESS,B084,53290,53027,Beaumont-Pied-de-Bœuf,53,,,530270000B0174,,,,,,,,,,,,,0,,,,,T,terres,,,5612,-0.419942,47.914827
2021-892033,2021-10-15,000002,Vente,488752,,,LA STREE,B511,53290,53027,Beaumont-Pied-de-Bœuf,53,,,530270000B0175,,,,,,,,,,,,,0,,,,,T,terres,,,18290,-0.418817,47.914339
2021-892033,2021-10-15,000002,Vente,488752,,,LE CLOSEAU DU FOUGERAY,B136,53290,53027,Beaumont-Pied-de-Bœuf,53,,,530270000B0176,,,,,,,,,,,,,0,,,,,T,terres,,,6525,-0.420508,47.914062
2021-892033,2021-10-15,000002,Vente,488752,,,LE FOUGERAY,B164,53290,53027,Beaumont-Pied-de-Bœuf,53,,,530270000B0177,,,,,,,,,,,,,0,,,,,T,terres,,,11240,-0.421316,47.913653
2021-892033,2021-10-15,000002,Vente,488752,,,LE CHAMP DU BOIS,B085,53290,53027,Beaumont-Pied-de-Bœuf,53,,,530270000B0178,,,,,,,,,,,,,0,,,,,P,prés,,,11100,-0.421251,47.912175
2021-892033,2021-10-15,000002,Vente,488752,,,LE VERGER,B528,53290,53027,Beaumont-Pied-de-Bœuf,53,,,530270000B0179,,,,,,,,,,,,,0,,,,,VE,vergers,POMME,Pommiers,9870,-0.421646,47.911123
2021-892033,2021-10-15,000002,Vente,488752,,,LE TAILLIS,B513,53290,53027,Beaumont-Pied-de-Bœuf,53,,,530270000B0180,,,,,,,,,,,,,0,,,,,BS,taillis sous futaie,,,22590,-0.420064,47.910857
2021-892033,2021-10-15,000002,Vente,488752,,,LA GRANDE PIECE,B209,53290,53027,Beaumont-Pied-de-Bœuf,53,,,530270000B0181,,,,,,,,,,,,,0,,,,,T,terres,,,35460,-0.419568,47.912251
2021-892033,2021-10-15,000002,Vente,488752,,,LA SABLONNIERE,B508,53290,53027,Beaumont-Pied-de-Bœuf,53,,,530270000B0182,,,,,,,,,,,,,0,,,,,P,prés,,,11420,-0.418332,47.911499
2021-892033,2021-10-15,000002,Vente,488752,,,LA SABLONNIERE,B508,53290,53027,Beaumont-Pied-de-Bœuf,53,,,530270000B0182,,,,,,,,,,,,,0,,,,,T,terres,,,24690,-0.418332,47.911499
2021-892033,2021-10-15,000002,Vente,488752,,,LA LANDE,B257,53290,53027,Beaumont-Pied-de-Bœuf,53,,,530270000B0183,,,,,,,,,,,,,0,,,,,T,terres,,,9315,-0.417218,47.912283
2021-892033,2021-10-15,000002,Vente,488752,,,L ALLEE,B004,53290,53027,Beaumont-Pied-de-Bœuf,53,,,530270000B0184,,,,,,,,,,,,,0,,,,,T,terres,,,3245,-0.417611,47.912923
2021-892033,2021-10-15,000002,Vente,488752,,,LA GRANDE LANDE,B205,53290,53027,Beaumont-Pied-de-Bœuf,53,,,530270000B0191,,,,,,,,,,,,,0,,,,,T,terres,,,13330,-0.416466,47.911283
2021-892033,2021-10-15,000002,Vente,488752,,,LA PETITE LANDE,B345,53290,53027,Beaumont-Pied-de-Bœuf,53,,,530270000B0192,,,,,,,,,,,,,0,,,,,T,terres,,,11105,-0.414896,47.910959
2021-892033,2021-10-15,000002,Vente,488752,,,LE VERGER DE LA ROUTE,B539,53290,53027,Beaumont-Pied-de-Bœuf,53,,,530270000B0193,,,,,,,,,,,,,0,,,,,VE,vergers,POMME,Pommiers,3280,-0.414694,47.910179
2021-892033,2021-10-15,000002,Vente,488752,,,LA JAULAIE,B253,53290,53027,Beaumont-Pied-de-Bœuf,53,,,530270000B0394,,,,,,,,,,,,,0,,,,,BT,taillis simples,,,80,-0.413823,47.900744
2021-892033,2021-10-15,000002,Vente,488752,,,LE BRINDEAU,B033,53290,53027,Beaumont-Pied-de-Bœuf,53,,,530270000B0462,,,,,,,,,,,,,0,,,,,T,terres,,,13770,-0.420766,47.918301
2021-892033,2021-10-15,000002,Vente,488752,,,LE CHAMP DE LA MAISON NEUV,B073,53290,53027,Beaumont-Pied-de-Bœuf,53,,,530270000B0492,,,,,,,,,,,,,0,,,,,T,terres,,,855,-0.417224,47.913837
2021-892033,2021-10-15,000002,Vente,488752,,,LA GRANDE LANDE,B205,53290,53027,Beaumont-Pied-de-Bœuf,53,,,530270000B0494,,,,,,,,,,,,,0,,,,,T,terres,,,4500,-0.416788,47.914617
2021-892033,2021-10-15,000002,Vente,488752,,,L ALLEE,B004,53290,53027,Beaumont-Pied-de-Bœuf,53,,,530270000B0579,,,,,,,,,,,,,0,,,,,T,terres,,,152,-0.415191,47.908623
2021-892033,2021-10-15,000002,Vente,488752,1,,LES JARRIAIS,B252,53290,53027,Beaumont-Pied-de-Bœuf,53,,,530270000B0651,,,,,,,,,,,,,0,1,Maison,194,5,AG,terrains d'agrément,,,3514,-0.421373,47.914528
2021-892033,2021-10-15,000002,Vente,488752,1,,LES JARRIAIS,B252,53290,53027,Beaumont-Pied-de-Bœuf,53,,,530270000B0651,,,,,,,,,,,,,0,1,Maison,194,5,S,sols,,,3649,-0.421373,47.914528
2021-892383,2021-11-09,000001,Vente,170000,1,,LA VIGNE,B549,53290,53027,Beaumont-Pied-de-Bœuf,53,,,530270000B0455,,,,,,,,,,,,,0,1,Maison,156,5,AG,terrains d'agrément,,,1904,-0.429391,47.904814
2021-892383,2021-11-09,000001,Vente,170000,1,,LA VIGNE,B549,53290,53027,Beaumont-Pied-de-Bœuf,53,,,530270000B0455,,,,,,,,,,,,,0,1,Maison,156,5,S,sols,,,630,-0.429391,47.904814
2021-892383,2021-11-09,000001,Vente,170000,,,LA VIGNE,B549,53290,53027,Beaumont-Pied-de-Bœuf,53,,,530270000B0474,,,,,,,,,,,,,0,,,,,VE,vergers,POMME,Pommiers,1412,-0.428976,47.904697
2021-893709,2021-12-24,000002,Vente,80000,,,LA MOTTE ALAIN,B278,53290,53027,Beaumont-Pied-de-Bœuf,53,,,530270000C0296,,,,,,,,,,,,,0,,,,,S,sols,,,288,-0.461887,47.899588
2021-893709,2021-12-24,000002,Vente,80000,,,LE CHAMP DE LA COUR,B066,53290,53027,Beaumont-Pied-de-Bœuf,53,,,530270000C0319,,,,,,,,,,,,,0,,,,,T,terres,,,462,-0.461542,47.89992
2021-893709,2021-12-24,000002,Vente,80000,,,LE JARDIN,B248,53290,53027,Beaumont-Pied-de-Bœuf,53,,,530270000C0321,,,,,,,,,,,,,0,,,,,T,terres,,,425,-0.461942,47.900195
2021-893709,2021-12-24,000002,Vente,80000,,,LE VERGER,B528,53290,53027,Beaumont-Pied-de-Bœuf,53,,,530270000C0326,,,,,,,,,,,,,0,,,,,T,terres,,,7,-0.462138,47.900345
2021-893709,2021-12-24,000002,Vente,80000,,,CHEM DE LA MARE,B106,53290,53027,Beaumont-Pied-de-Bœuf,53,,,530270000C0328,,,,,,,,,,,,,0,,,,,T,terres,,,71,-0.462136,47.900309
2021-893709,2021-12-24,000002,Vente,80000,1,,LA MOTTE ALAIN,B278,53290,53027,Beaumont-Pied-de-Bœuf,53,,,530270000C0332,,,,,,,,,,,,,0,1,Maison,100,4,S,sols,,,1655,-0.461979,47.900007
