id_mutation,date_mutation,numero_disposition,nature_mutation,valeur_fonciere,adresse_numero,adresse_suffixe,adresse_nom_voie,adresse_code_voie,code_postal,code_commune,nom_commune,code_departement,ancien_code_commune,ancien_nom_commune,id_parcelle,ancien_id_parcelle,numero_volume,lot1_numero,lot1_surface_carrez,lot2_numero,lot2_surface_carrez,lot3_numero,lot3_surface_carrez,lot4_numero,lot4_surface_carrez,lot5_numero,lot5_surface_carrez,nombre_lots,code_type_local,type_local,surface_reelle_bati,nombre_pieces_principales,code_nature_culture,nature_culture,code_nature_culture_speciale,nature_culture_speciale,surface_terrain,longitude,latitude
2021-885054,2021-01-29,000002,Vente,89000,,,LE HAUT LOZE,B025,53300,53111,La Haie-Traversaine,53,,,53111000ZC0104,,,,,,,,,,,,,0,,,,,J,jardins,POTAG,Jardin potager,80,-0.60624,48.371172
2021-885054,2021-01-29,000002,Vente,89000,11,,RES DES 2 RIVIERES,A001,53300,53111,La Haie-Traversaine,53,,,53111000ZC0119,,,,,,,,,,,,,0,1,Maison,82,4,S,sols,,,402,-0.606091,48.371207
2021-885054,2021-01-29,000002,Vente,89000,11,,RES DES 2 RIVIERES,A001,53300,53111,La Haie-Traversaine,53,,,53111000ZC0119,,,,,,,,,,,,,0,1,Maison,82,4,S,sols,,,402,-0.606091,48.371207
2021-886930,2021-04-13,000001,Vente,220000,,,LE HAUT MORTIER,B026,53300,53111,La Haie-Traversaine,53,,,53111000ZM0006,,,,,,,,,,,,,0,,,,,S,sols,,,30,-0.626706,48.358344
2021-886930,2021-04-13,000001,Vente,220000,,,LE HAUT MORTIER,B026,53300,53111,La Haie-Traversaine,53,,,53111000ZM0052,,,,,,,,,,,,,0,,,,,P,prés,,,300,-0.625645,48.358323
2021-886930,2021-04-13,000001,Vente,220000,,,LE HAUT MORTIER,B026,53300,53111,La Haie-Traversaine,53,,,53111000ZM0052,,,,,,,,,,,,,0,,,,,P,prés,,,1152,-0.625645,48.358323
2021-886930,2021-04-13,000001,Vente,220000,,,LE HAUT MORTIER,B026,53300,53111,La Haie-Traversaine,53,,,53111000ZM0052,,,,,,,,,,,,,0,,,,,T,terres,,,1000,-0.625645,48.358323
2021-886930,2021-04-13,000001,Vente,220000,,,LE HAUT MORTIER,B026,53300,53111,La Haie-Traversaine,53,,,53111000ZM0055,,,,,,,,,,,,,0,,,,,S,sols,,,258,-0.626758,48.358234
2021-886930,2021-04-13,000001,Vente,220000,2,,LES MORTIERS,B061,53300,53111,La Haie-Traversaine,53,,,53111000ZM0057,,,,,,,,,,,,,0,1,Maison,219,6,J,jardins,POTAG,Jardin potager,1452,-0.626323,48.358298
2021-886930,2021-04-13,000001,Vente,220000,2,,LES MORTIERS,B061,53300,53111,La Haie-Traversaine,53,,,53111000ZM0057,,,,,,,,,,,,,0,1,Maison,219,6,S,sols,,,900,-0.626323,48.358298
2021-886930,2021-04-13,000001,Vente,220000,,,LE HAUT MORTIER,B026,53300,53111,La Haie-Traversaine,53,,,53111000ZM0078,,,,,,,,,,,,,0,,,,,S,sols,,,130,-0.626605,48.358247
2021-888206,2021-05-29,000001,Vente,165000,1,,LA TEURERIE,B044,53300,53111,La Haie-Traversaine,53,,,53111000ZN0034,,,,,,,,,,,,,0,1,Maison,192,6,S,sols,,,2000,-0.618269,48.36615
2021-888206,2021-05-29,000001,Vente,165000,1,,LA TEURERIE,B044,53300,53111,La Haie-Traversaine,53,,,53111000ZN0034,,,,,,,,,,,,,0,1,Maison,192,6,P,prés,,,8900,-0.618269,48.36615
2021-888385,2021-06-02,000001,Vente,39000,24,,RUE DE NORMANDIE,0035,53300,53111,La Haie-Traversaine,53,,,531110000E0295,,,,,,,,,,,,,0,3,Dépendance,,0,S,sols,,,130,-0.606825,48.369124
2021-888385,2021-06-02,000001,Vente,39000,24,,RUE DE NORMANDIE,0035,53300,53111,La Haie-Traversaine,53,,,531110000E0295,,,,,,,,,,,,,0,4,Local industriel. commercial ou assimilé,140,0,S,sols,,,130,-0.606825,48.369124
2021-888385,2021-06-02,000001,Vente,39000,24,,RUE DE NORMANDIE,0035,53300,53111,La Haie-Traversaine,53,,,531110000E0295,,,,,,,,,,,,,0,1,Maison,70,5,S,sols,,,130,-0.606825,48.369124
2021-888385,2021-06-02,000001,Vente,39000,,,LE BOURG,B009,53300,53111,La Haie-Traversaine,53,,,531110000E0300,,,,,,,,,,,,,0,,,,,J,jardins,POTAG,Jardin potager,340,-0.607049,48.369098
2021-888385,2021-06-02,000001,Vente,39000,5024,,RUE DE NORMANDIE,0035,53300,53111,La Haie-Traversaine,53,,,531110000E0301,,,,,,,,,,,,,0,3,Dépendance,,0,S,sols,,,20,-0.607191,48.369103
2021-888385,2021-06-02,000001,Vente,39000,,,RUE DE NORMANDIE,0035,53300,53111,La Haie-Traversaine,53,,,531110000E0464,,,,,,,,,,,,,0,,,,,S,sols,,,66,-0.607214,48.369117
2021-888385,2021-06-02,000001,Vente,39000,,,RUE DE LA COLMONT,0031,53300,53111,La Haie-Traversaine,53,,,531110000E0465,,,,,,,,,,,,,0,,,,,S,sols,,,80,-0.60735,48.369247
2021-888438,2021-06-02,000001,Vente,1200,,,LA RAVERIE,B040,53300,53111,La Haie-Traversaine,53,,,53111000ZE0028,,,,,,,,,,,,,0,,,,,VE,vergers,,,840,-0.610771,48.358351
2021-888443,2021-06-02,000001,Vente,115000,,,LA RAVERIE,B040,53300,53111,La Haie-Traversaine,53,,,53111000ZE0033,,,,,,,,,,,,,0,,,,,J,jardins,POTAG,Jardin potager,260,-0.611016,48.358392
2021-888443,2021-06-02,000001,Vente,115000,1,B,LA RAVERIE,B040,53300,53111,La Haie-Traversaine,53,,,53111000ZE0149,,,,,,,,,,,,,0,1,Maison,105,5,S,sols,,,3688,-0.610752,48.35812
2021-888443,2021-06-02,000001,Vente,115000,1,B,LA RAVERIE,B040,53300,53111,La Haie-Traversaine,53,,,53111000ZE0149,,,,,,,,,,,,,0,1,Maison,43,3,S,sols,,,3688,-0.610752,48.35812
2021-888624,2021-06-10,000001,Vente,156000,6,,RES DES CHENES,A010,53300,53111,La Haie-Traversaine,53,,,53111000ZE0162,,,,,,,,,,,,,0,1,Maison,90,4,S,sols,,,735,-0.60589,48.365944
2021-888693,2021-06-29,000002,Vente,13000,,,ROUESSON,B042,53300,53111,La Haie-Traversaine,53,,,53111000ZB0063,,,,,,,,,,,,,0,,,,,S,sols,,,55,-0.624405,48.369263
2021-888693,2021-06-29,000002,Vente,13000,6,,ROUESSON,B042,53300,53111,La Haie-Traversaine,53,,,53111000ZB0064,,,,,,,,,,,,,0,,,,,S,sols,,,32,-0.62436,48.369294
2021-888693,2021-06-29,000002,Vente,13000,6,,ROUESSON,B042,53300,53111,La Haie-Traversaine,53,,,53111000ZB0065,,,,,,,,,,,,,0,1,Maison,37,1,S,sols,,,136,-0.624286,48.369315
2021-888693,2021-06-29,000002,Vente,13000,,,ROUESSON,B042,53300,53111,La Haie-Traversaine,53,,,53111000ZB0103,,,,,,,,,,,,,0,,,,,P,prés,,,296,-0.62432,48.369362
2021-888693,2021-06-29,000002,Vente,13000,,,ROUESSON,B042,53300,53111,La Haie-Traversaine,53,,,53111000ZB0106,,,,,,,,,,,,,0,,,,,S,sols,,,46,-0.624145,48.369396
2021-890147,2021-08-06,000001,Vente,87000,1,,LA PILLERIE,B035,53300,53111,La Haie-Traversaine,53,,,53111000ZL0070,,,,,,,,,,,,,0,1,Maison,112,6,S,sols,,,500,-0.624163,48.346964
2021-890147,2021-08-06,000001,Vente,87000,1,,LA PILLERIE,B035,53300,53111,La Haie-Traversaine,53,,,53111000ZL0070,,,,,,,,,,,,,0,1,Maison,112,6,J,jardins,POTAG,Jardin potager,1048,-0.624163,48.346964
2021-890147,2021-08-06,000001,Vente,87000,,,LA PILLERIE,B035,53300,53111,La Haie-Traversaine,53,,,53111000ZL0074,,,,,,,,,,,,,0,,,,,J,jardins,POTAG,Jardin potager,83,-0.623805,48.346862
2021-892312,2021-10-26,000001,Vente,15000,,,LE GUERET VIEUX,B022,53300,53111,La Haie-Traversaine,53,,,53111000ZH0061,,,,,,,,,,,,,0,,,,,P,prés,,,1368,,
2021-892312,2021-10-26,000001,Vente,15000,,,LE GUERET VIEUX,B022,53300,53111,La Haie-Traversaine,53,,,53111000ZH0061,,,,,,,,,,,,,0,,,,,P,prés,,,2736,,
2021-892312,2021-10-26,000001,Vente,15000,,,LE GUERET VIEUX,B022,53300,53111,La Haie-Traversaine,53,,,53111000ZH0063,,,,,,,,,,,,,0,,,,,P,prés,,,12174,,
2021-892312,2021-10-26,000001,Vente,15000,,,LE GUERET VIEUX,B022,53300,53111,La Haie-Traversaine,53,,,53111000ZH0063,,,,,,,,,,,,,0,,,,,P,prés,,,1062,,
2021-892312,2021-10-26,000001,Vente,15000,,,LA PILLERIE,B035,53300,53111,La Haie-Traversaine,53,,,53111000ZL0039,,,,,,,,,,,,,0,,,,,P,prés,,,350,-0.617148,48.34443
2021-892312,2021-10-26,000001,Vente,15000,,,LA PILLERIE,B035,53300,53111,La Haie-Traversaine,53,,,53111000ZL0040,,,,,,,,,,,,,0,,,,,P,prés,,,615,-0.616576,48.344199
2021-892312,2021-10-26,000001,Vente,15000,,,LA PILLERIE,B035,53300,53111,La Haie-Traversaine,53,,,53111000ZL0057,,,,,,,,,,,,,0,,,,,E,eaux,ETANG,Etangs,76,-0.617191,48.344343
2021-892312,2021-10-26,000001,Vente,15000,,,LA PILLERIE,B035,53300,53111,La Haie-Traversaine,53,,,53111000ZL0059,,,,,,,,,,,,,0,,,,,E,eaux,ETANG,Etangs,455,-0.61976,48.345782
2021-892312,2021-10-26,000001,Vente,15000,,,LA PILLERIE,B035,53300,53111,La Haie-Traversaine,53,,,53111000ZL0077,,,,,,,,,,,,,0,,,,,E,eaux,ETANG,Etangs,252,-0.616404,48.344078
2021-892701,2021-11-12,000001,Vente,32623.5,23,,RES DES CHENES,A010,53300,53111,La Haie-Traversaine,53,,,53111000ZE0173,,,,,,,,,,,,,0,,,,,AB,terrains a bâtir,,,717,-0.604676,48.366235
2021-892875,2021-11-22,000001,Vente,74000,2,,RUE DE NORMANDIE,0035,53300,53111,La Haie-Traversaine,53,,,531110000E0235,,,,,,,,,,,,,0,3,Dépendance,,0,S,sols,,,225,-0.606867,48.370004
2021-892875,2021-11-22,000001,Vente,74000,2,,RUE DE NORMANDIE,0035,53300,53111,La Haie-Traversaine,53,,,531110000E0235,,,,,,,,,,,,,0,3,Dépendance,,0,S,sols,,,225,-0.606867,48.370004
2021-892875,2021-11-22,000001,Vente,74000,2,,RUE DE NORMANDIE,0035,53300,53111,La Haie-Traversaine,53,,,531110000E0235,,,,,,,,,,,,,0,1,Maison,245,9,S,sols,,,225,-0.606867,48.370004
2021-892875,2021-11-22,000001,Vente,74000,,,LE BOURG,B009,53300,53111,La Haie-Traversaine,53,,,531110000E0236,,,,,,,,,,,,,0,,,,,J,jardins,POTAG,Jardin potager,464,-0.606997,48.36998
2021-892986,2021-12-04,000001,Vente,97500,9,,RUE DU MAINE,0089,53300,53111,La Haie-Traversaine,53,,,531110000E0430,,,,,,,,,,,,,0,1,Maison,79,4,S,sols,,,1235,-0.606157,48.367816
2021-893397,2021-12-08,000002,Vente,140000,4,,LES MORTIERS,B061,53300,53111,La Haie-Traversaine,53,,,53111000ZM0068,,,,,,,,,,,,,0,1,Maison,90,5,S,sols,,,730,-0.627039,48.35827
2021-893397,2021-12-08,000002,Vente,140000,4,,LES MORTIERS,B061,53300,53111,La Haie-Traversaine,53,,,53111000ZM0068,,,,,,,,,,,,,0,3,Dépendance,,0,S,sols,,,730,-0.627039,48.35827
2021-893397,2021-12-08,000002,Vente,140000,,,LE HAUT MORTIER,B026,53300,53111,La Haie-Traversaine,53,,,53111000ZM0069,,,,,,,,,,,,,0,,,,,S,sols,,,1010,-0.627291,48.358364
