id_mutation,date_mutation,numero_disposition,nature_mutation,valeur_fonciere,adresse_numero,adresse_suffixe,adresse_nom_voie,adresse_code_voie,code_postal,code_commune,nom_commune,code_departement,ancien_code_commune,ancien_nom_commune,id_parcelle,ancien_id_parcelle,numero_volume,lot1_numero,lot1_surface_carrez,lot2_numero,lot2_surface_carrez,lot3_numero,lot3_surface_carrez,lot4_numero,lot4_surface_carrez,lot5_numero,lot5_surface_carrez,nombre_lots,code_type_local,type_local,surface_reelle_bati,nombre_pieces_principales,code_nature_culture,nature_culture,code_nature_culture_speciale,nature_culture_speciale,surface_terrain,longitude,latitude
2021-884755,2021-01-12,000001,Vente,208000,,,TERRE NEUVE,B117,53220,53177,La Pellerine,53,,,531770000B0265,,,,,,,,,,,,,0,1,Maison,164,4,S,sols,,,660,-1.044517,48.325833
2021-884755,2021-01-12,000001,Vente,208000,,,TERRE NEUVE,B117,53220,53177,La Pellerine,53,,,531770000B0975,,,,,,,,,,,,,0,,,,,S,sols,,,815,-1.044445,48.325735
2021-884755,2021-01-12,000001,Vente,208000,,,TERRE NEUVE,B117,53220,53177,La Pellerine,53,,,531770000B0977,,,,,,,,,,,,,0,,,,,S,sols,,,52,-1.044463,48.325953
2021-884755,2021-01-12,000001,Vente,208000,,,TERRE NEUVE,B117,53220,53177,La Pellerine,53,,,531770000B0978,,,,,,,,,,,,,0,,,,,P,prés,,,2482,-1.04455,48.326245
2021-884755,2021-01-12,000001,Vente,208000,,,TERRE NEUVE,B117,53220,53177,La Pellerine,53,,,531770000B1005,,,,,,,,,,,,,0,,,,,P,prés,,,8898,-1.04349,48.325755
2021-886260,2021-03-11,000001,Vente,49142,15,,RUE DU MAINE,0018,53220,53177,La Pellerine,53,,,531770000B0737,,,,,,,,,,,,,0,1,Maison,85,4,S,sols,,,412,-1.049758,48.314008
2021-886260,2021-03-11,000001,Vente,49142,15,,RUE DU MAINE,0018,53220,53177,La Pellerine,53,,,531770000B0737,,,,,,,,,,,,,0,1,Maison,85,4,J,jardins,,,763,-1.049758,48.314008
2021-886792,2021-03-31,000001,Vente,120000,5,,RUE DE LA FUTAIE,0015,53220,53177,La Pellerine,53,,,531770000B1109,,,,,,,,,,,,,0,1,Maison,71,4,S,sols,,,887,-1.052627,48.316761
2021-888340,2021-05-19,000001,Vente,148133.73,,,BOIS VALLET,B015,53220,53177,La Pellerine,53,,,531770000B0121,,,,,,,,,,,,,0,,,,,P,prés,,,3233,-1.034436,48.329471
2021-888341,2021-05-19,000003,Vente,303368.88,,,LA BASSE AUVRIE,B008,53220,53177,La Pellerine,53,,,531770000B0261,,,,,,,,,,,,,0,,,,,T,terres,,,8400,-1.041949,48.323259
2021-888341,2021-05-19,000003,Vente,303368.88,,,LA PETITE GAUDE,B102,53220,53177,La Pellerine,53,,,531770000B0290,,,,,,,,,,,,,0,,,,,T,terres,,,11905,-1.048121,48.323407
2021-888341,2021-05-19,000003,Vente,303368.88,,,LA BASSE AUVRIE,B008,53220,53177,La Pellerine,53,,,531770000B0297,,,,,,,,,,,,,0,,,,,T,terres,,,9122,-1.045977,48.323328
2021-888341,2021-05-19,000003,Vente,303368.88,,,LA HACHE,B067,53220,53177,La Pellerine,53,,,531770000B0576,,,,,,,,,,,,,0,,,,,P,prés,,,15480,-1.042352,48.324416
2021-888341,2021-05-19,000003,Vente,303368.88,,,L AUVRIE LONGUE,B005,53220,53177,La Pellerine,53,,,531770000B0582,,,,,,,,,,,,,0,,,,,T,terres,,,6258,-1.041988,48.322208
2021-888341,2021-05-19,000003,Vente,303368.88,,,LE CHEMIN,B045,53220,53177,La Pellerine,53,,,531770000B0605,,,,,,,,,,,,,0,,,,,T,terres,,,187,-1.042693,48.322726
2021-888341,2021-05-19,000003,Vente,303368.88,,,LES CHALONGES,B023,53220,53177,La Pellerine,53,,,531770000B0610,,,,,,,,,,,,,0,,,,,T,terres,,,270,-1.049324,48.323117
2021-888341,2021-05-19,000003,Vente,303368.88,,,L AUVRIE,B004,53220,53177,La Pellerine,53,,,531770000B0641,,,,,,,,,,,,,0,,,,,T,terres,,,3200,-1.041474,48.323494
2021-888341,2021-05-19,000003,Vente,303368.88,,,L AUVRIE,B004,53220,53177,La Pellerine,53,,,531770000B0666,,,,,,,,,,,,,0,,,,,P,prés,,,78,-1.038611,48.323318
2021-888341,2021-05-19,000003,Vente,303368.88,,,L AUVRIE,B004,53220,53177,La Pellerine,53,,,531770000B0668,,,,,,,,,,,,,0,,,,,P,prés,,,30,-1.04113,48.323053
2021-888341,2021-05-19,000003,Vente,303368.88,,,TERRE NEUVE,B117,53220,53177,La Pellerine,53,,,531770000B0782,,,,,,,,,,,,,0,,,,,P,prés,,,24650,-1.045124,48.323936
2021-888341,2021-05-19,000003,Vente,303368.88,,,LA BASSE AUVRIE,B008,53220,53177,La Pellerine,53,,,531770000B0784,,,,,,,,,,,,,0,,,,,P,prés,,,125,-1.044567,48.323108
2021-888341,2021-05-19,000003,Vente,303368.88,,,LA BASSE AUVRIE,B008,53220,53177,La Pellerine,53,,,531770000B0837,,,,,,,,,,,,,0,,,,,T,terres,,,4868,-1.041204,48.322622
2021-888341,2021-05-19,000003,Vente,303368.88,,,L AUVRIE,B004,53220,53177,La Pellerine,53,,,531770000B0840,,,,,,,,,,,,,0,,,,,P,prés,,,1865,-1.0407,48.322735
2021-888341,2021-05-19,000003,Vente,303368.88,,,BOIS VALLEE,B014,53220,53177,La Pellerine,53,,,531770000B0991,,,,,,,,,,,,,0,,,,,T,terres,,,16979,-1.039761,48.323192
2021-888341,2021-05-19,000003,Vente,303368.88,,,HERBAGES DE LA HOUDUSSIERE,B073,53220,53177,La Pellerine,53,,,531770000B0992,,,,,,,,,,,,,0,,,,,P,prés,,,15062,-1.042084,48.325306
2021-888341,2021-05-19,000003,Vente,303368.88,,,L AUVRIE,B004,53220,53177,La Pellerine,53,,,531770000B0994,,,,,,,,,,,,,0,,,,,T,terres,,,12529,-1.040687,48.324159
2021-888341,2021-05-19,000003,Vente,303368.88,,,TERRE NEUVE,B117,53220,53177,La Pellerine,53,,,531770000B1006,,,,,,,,,,,,,0,,,,,P,prés,,,6580,-1.044177,48.32484
2021-888341,2021-05-19,000003,Vente,303368.88,,,TERRE NEUVE,B117,53220,53177,La Pellerine,53,,,531770000B1007,,,,,,,,,,,,,0,,,,,P,prés,,,8642,-1.042896,48.324624
2021-888341,2021-05-19,000003,Vente,303368.88,,,LA BASSE AUVRIE,B008,53220,53177,La Pellerine,53,,,531770000B1171,,,,,,,,,,,,,0,,,,,T,terres,,,61,-1.042993,48.32306
2021-888341,2021-05-19,000003,Vente,303368.88,,,LA BASSE AUVRIE,B008,53220,53177,La Pellerine,53,,,531770000B1172,,,,,,,,,,,,,0,,,,,T,terres,,,1401,-1.042776,48.322959
2021-888756,2021-06-11,000001,Vente,68000,5073,,BRESSAC,B019,53220,53177,La Pellerine,53,,,531770000A1166,,,,,,,,,,,,,0,1,Maison,54,3,S,sols,,,1000,-1.006157,48.324979
2021-888756,2021-06-11,000001,Vente,68000,5073,,BRESSAC,B019,53220,53177,La Pellerine,53,,,531770000A1166,,,,,,,,,,,,,0,1,Maison,54,3,J,jardins,,,602,-1.006157,48.324979
2021-888756,2021-06-11,000001,Vente,68000,5073,,BRESSAC,B019,53220,53177,La Pellerine,53,,,531770000A1166,,,,,,,,,,,,,0,3,Dépendance,,0,J,jardins,,,602,-1.006157,48.324979
2021-888756,2021-06-11,000001,Vente,68000,5073,,BRESSAC,B019,53220,53177,La Pellerine,53,,,531770000A1166,,,,,,,,,,,,,0,3,Dépendance,,0,S,sols,,,1000,-1.006157,48.324979
2021-888756,2021-06-11,000001,Vente,68000,,,BRESSAC,B019,53220,53177,La Pellerine,53,,,531770000A1167,,,,,,,,,,,,,0,,,,,S,sols,,,378,-1.006134,48.325679
2021-890116,2021-08-18,000001,Vente,70000,4,,RUE DE BRETAGNE,0005,53220,53177,La Pellerine,53,,,531770000B0483,,,,,,,,,,,,,0,3,Dépendance,,0,S,sols,,,142,-1.052499,48.314893
2021-890116,2021-08-18,000001,Vente,70000,4,,RUE DE BRETAGNE,0005,53220,53177,La Pellerine,53,,,531770000B0483,,,,,,,,,,,,,0,1,Maison,88,5,S,sols,,,142,-1.052499,48.314893
2021-890116,2021-08-18,000001,Vente,70000,5023,A,LE BOURG,B017,53220,53177,La Pellerine,53,,,531770000B0816,,,,,,,,,,,,,0,3,Dépendance,,0,S,sols,,,207,-1.052472,48.315002
2021-890116,2021-08-18,000001,Vente,70000,,,LE BOURG,B017,53220,53177,La Pellerine,53,,,531770000B0828,,,,,,,,,,,,,0,,,,,S,sols,,,6,-1.052426,48.31496
2021-892122,2021-10-25,000002,Vente,9726,,,LE CHAMP DU PATIS,B040,53220,53177,La Pellerine,53,,,531770000B1218,,,,,,,,,,,,,0,,,,,P,prés,,,1621,-1.051185,48.312251
2021-892227,2021-11-02,000001,Vente,127000,5135,,LA GAUDE,B055,53220,53177,La Pellerine,53,,,531770000B0275,,,,,,,,,,,,,0,1,Maison,89,4,P,prés,,,2000,-1.045199,48.326887
2021-892227,2021-11-02,000001,Vente,127000,5135,,LA GAUDE,B055,53220,53177,La Pellerine,53,,,531770000B0275,,,,,,,,,,,,,0,3,Dépendance,,0,S,sols,,,500,-1.045199,48.326887
2021-892227,2021-11-02,000001,Vente,127000,5135,,LA GAUDE,B055,53220,53177,La Pellerine,53,,,531770000B0275,,,,,,,,,,,,,0,1,Maison,89,4,S,sols,,,500,-1.045199,48.326887
2021-892227,2021-11-02,000001,Vente,127000,5135,,LA GAUDE,B055,53220,53177,La Pellerine,53,,,531770000B0275,,,,,,,,,,,,,0,3,Dépendance,,0,P,prés,,,2000,-1.045199,48.326887
2021-892227,2021-11-02,000001,Vente,127000,,,LA GAUDE,B055,53220,53177,La Pellerine,53,,,531770000B0276,,,,,,,,,,,,,0,,,,,T,terres,,,3074,-1.045772,48.32684
2021-892846,2021-11-26,000002,Vente,64,,,LES CHALONGES,B023,53220,53177,La Pellerine,53,,,531770000B1215,,,,,,,,,,,,,0,,,,,T,terres,,,64,-1.05501,48.316415
2021-893157,2021-12-08,000002,Echange,19183.67,,,LA PORTE,B103,53220,53177,La Pellerine,53,,,531770000A0121,,,,,,,,,,,,,0,,,,,T,terres,,,5909,-1.016659,48.322585
2021-893157,2021-12-08,000002,Echange,19183.67,,,LA GRURIE,B065,53220,53177,La Pellerine,53,,,531770000A0123,,,,,,,,,,,,,0,,,,,T,terres,,,9602,-1.01866,48.321827
2021-893157,2021-12-08,000002,Echange,19183.67,,,LA GRURIE,B065,53220,53177,La Pellerine,53,,,531770000A0124,,,,,,,,,,,,,0,,,,,T,terres,,,2448,-1.019422,48.322703
2021-893157,2021-12-08,000002,Echange,19183.67,,,LA GRURIE,B065,53220,53177,La Pellerine,53,,,531770000A0125,,,,,,,,,,,,,0,,,,,T,terres,,,8086,-1.019349,48.321635
2021-893157,2021-12-08,000002,Echange,19183.67,,,BELOUZE,B010,53220,53177,La Pellerine,53,,,531770000A1210,,,,,,,,,,,,,0,,,,,P,prés,,,74,-1.018946,48.322861
2021-893157,2021-12-08,000002,Echange,19183.67,,,LA GRURIE,B065,53220,53177,La Pellerine,53,,,531770000A1211,,,,,,,,,,,,,0,,,,,P,prés,,,160,-1.019424,48.322902
2021-893157,2021-12-08,000003,Echange,19183.67,,,LA GRURIE,B065,53220,53177,La Pellerine,53,,,531770000A0052,,,,,,,,,,,,,0,,,,,T,terres,,,16318,-1.018732,48.323398
2021-893157,2021-12-08,000003,Echange,19183.67,,,LA GRURIE,B065,53220,53177,La Pellerine,53,,,531770000A1207,,,,,,,,,,,,,0,,,,,T,terres,,,9467,-1.020304,48.323209
2021-893157,2021-12-08,000003,Echange,19183.67,,,LA GRURIE,B065,53220,53177,La Pellerine,53,,,531770000A1216,,,,,,,,,,,,,0,,,,,T,terres,,,495,-1.019734,48.32341
2021-893158,2021-12-08,000004,Echange,926.37,,,LA GRURIE,B065,53220,53177,La Pellerine,53,,,531770000A1208,,,,,,,,,,,,,0,,,,,T,terres,,,242,-1.021493,48.323368
2021-893158,2021-12-08,000004,Echange,926.37,,,LA GRURIE,B065,53220,53177,La Pellerine,53,,,531770000A1214,,,,,,,,,,,,,0,,,,,P,prés,,,1027,-1.021865,48.323325
2021-893158,2021-12-08,000005,Echange,926.37,,,LE MARAIS,B088,53220,53177,La Pellerine,53,,,531770000A0155,,,,,,,,,,,,,0,,,,,P,prés,,,1269,-1.019161,48.31925
2021-893773,2021-12-31,000001,Vente,80000,5074,,BELOUZE,B010,53220,53177,La Pellerine,53,,,531770000A1164,,,,,,,,,,,,,0,1,Maison,205,6,J,jardins,,,3166,-1.008643,48.321929
2021-893773,2021-12-31,000001,Vente,80000,5074,,BELOUZE,B010,53220,53177,La Pellerine,53,,,531770000A1164,,,,,,,,,,,,,0,1,Maison,205,6,S,sols,,,2000,-1.008643,48.321929
