id_mutation,date_mutation,numero_disposition,nature_mutation,valeur_fonciere,adresse_numero,adresse_suffixe,adresse_nom_voie,adresse_code_voie,code_postal,code_commune,nom_commune,code_departement,ancien_code_commune,ancien_nom_commune,id_parcelle,ancien_id_parcelle,numero_volume,lot1_numero,lot1_surface_carrez,lot2_numero,lot2_surface_carrez,lot3_numero,lot3_surface_carrez,lot4_numero,lot4_surface_carrez,lot5_numero,lot5_surface_carrez,nombre_lots,code_type_local,type_local,surface_reelle_bati,nombre_pieces_principales,code_nature_culture,nature_culture,code_nature_culture_speciale,nature_culture_speciale,surface_terrain,longitude,latitude
2021-884876,2021-01-07,000001,Vente,60000,110,,LA FRAIRIE,B550,53140,53185,Pré-en-Pail-Saint-Samson,53,,,53185000YD0064,,,,,,,,,,,,,0,1,Maison,80,3,J,jardins,,,560,-0.22927,48.463276
2021-884876,2021-01-07,000001,Vente,60000,110,,LA FRAIRIE,B550,53140,53185,Pré-en-Pail-Saint-Samson,53,,,53185000YD0064,,,,,,,,,,,,,0,1,Maison,80,3,S,sols,,,3762,-0.22927,48.463276
2021-884876,2021-01-07,000001,Vente,60000,110,,LA FRAIRIE,B550,53140,53185,Pré-en-Pail-Saint-Samson,53,,,53185000YD0064,,,,,,,,,,,,,0,1,Maison,80,3,VE,vergers,,,1071,-0.22927,48.463276
2021-885170,2021-02-05,000001,Vente,23000,182,,RUE ARISTIDE BRIAND,0080,53140,53185,Pré-en-Pail-Saint-Samson,53,,,53185000AC0359,,,,,,,,,,,,,0,1,Maison,82,3,S,sols,,,495,-0.203232,48.459357
2021-885179,2021-01-12,000001,Vente,170000,2,,LOT DU BOIS COUREE,0141,53140,53185,Pré-en-Pail-Saint-Samson,53,,,53185000ZS0126,,,,,,,,,,,,,0,1,Maison,148,6,S,sols,,,500,-0.210335,48.454558
2021-885179,2021-01-12,000001,Vente,170000,2,,LOT DU BOIS COUREE,0141,53140,53185,Pré-en-Pail-Saint-Samson,53,,,53185000ZS0126,,,,,,,,,,,,,0,1,Maison,148,6,J,jardins,,,650,-0.210335,48.454558
2021-885183,2021-01-22,000001,Vente,15000,,,LE GUE DAVID ST SAMSON,D158,53140,53185,Pré-en-Pail-Saint-Samson,53,,,53185252ZH0026,,,,,,,,,,,,,0,,,,,S,sols,,,120,-0.152176,48.477543
2021-885183,2021-01-22,000001,Vente,15000,,,LE GUE DAVID ST SAMSON,D158,53140,53185,Pré-en-Pail-Saint-Samson,53,,,53185252ZH0026,,,,,,,,,,,,,0,,,,,J,jardins,POTAG,Jardin potager,680,-0.152176,48.477543
2021-885183,2021-01-22,000001,Vente,15000,125,,LE GUE DAVID ST SAMSON,D158,53140,53185,Pré-en-Pail-Saint-Samson,53,,,53185252ZH0027,,,,,,,,,,,,,0,1,Maison,50,1,S,sols,,,140,-0.15222,48.477342
2021-885294,2021-01-26,000001,Vente,20000,,,LE PRE FROGER,C499,53140,53185,Pré-en-Pail-Saint-Samson,53,,,53185000ZE0012,,,,,,,,,,,,,0,,,,,P,prés,,,8112,-0.181548,48.410376
2021-885294,2021-01-26,000001,Vente,20000,,,LE PRE FROGER,C499,53140,53185,Pré-en-Pail-Saint-Samson,53,,,53185000ZE0012,,,,,,,,,,,,,0,,,,,P,prés,,,32448,-0.181548,48.410376
2021-885295,2021-01-26,000002,Vente,222500,,,LA NOUETTE EST,C749,53140,53185,Pré-en-Pail-Saint-Samson,53,,,53185000ZA0049,,,,,,,,,,,,,0,,,,,P,prés,,,18624,-0.174363,48.421411
2021-885295,2021-01-26,000002,Vente,222500,,,LA NOUETTE EST,C749,53140,53185,Pré-en-Pail-Saint-Samson,53,,,53185000ZA0049,,,,,,,,,,,,,0,,,,,P,prés,,,55872,-0.174363,48.421411
2021-885295,2021-01-26,000002,Vente,222500,,,LA NOUETTE EST,C749,53140,53185,Pré-en-Pail-Saint-Samson,53,,,53185000ZA0049,,,,,,,,,,,,,0,,,,,P,prés,,,18624,-0.174363,48.421411
2021-885295,2021-01-26,000002,Vente,222500,,,LA NOUETTE EST,C749,53140,53185,Pré-en-Pail-Saint-Samson,53,,,53185000ZD0028,,,,,,,,,,,,,0,,,,,T,terres,,,14453,-0.18193,48.421298
2021-885295,2021-01-26,000002,Vente,222500,,,LA NOUETTE EST,C749,53140,53185,Pré-en-Pail-Saint-Samson,53,,,53185000ZD0028,,,,,,,,,,,,,0,,,,,P,prés,,,8700,-0.18193,48.421298
2021-885295,2021-01-26,000002,Vente,222500,,,LA NOUETTE EST,C749,53140,53185,Pré-en-Pail-Saint-Samson,53,,,53185000ZD0028,,,,,,,,,,,,,0,,,,,P,prés,,,8700,-0.18193,48.421298
2021-885295,2021-01-26,000002,Vente,222500,,,LA NOUETTE EST,C749,53140,53185,Pré-en-Pail-Saint-Samson,53,,,53185000ZD0028,,,,,,,,,,,,,0,,,,,P,prés,,,17400,-0.18193,48.421298
2021-885295,2021-01-26,000002,Vente,222500,,,LA NOUETTE EST,C749,53140,53185,Pré-en-Pail-Saint-Samson,53,,,53185000ZD0028,,,,,,,,,,,,,0,,,,,P,prés,,,9077,-0.18193,48.421298
2021-885301,2021-01-26,000001,Vente,140000,105,,LA NOUETTE PRE EN PAIL,B954,53140,53185,Pré-en-Pail-Saint-Samson,53,,,53185000ZC0047,,,,,,,,,,,,,0,4,Local industriel. commercial ou assimilé,89,0,,,,,,-0.178585,48.421492
2021-885301,2021-01-26,000001,Vente,140000,105,,LA NOUETTE PRE EN PAIL,B954,53140,53185,Pré-en-Pail-Saint-Samson,53,,,53185000ZC0047,,,,,,,,,,,,,0,1,Maison,159,6,,,,,,-0.178585,48.421492
2021-885406,2021-02-02,000001,Vente,14000,9,,RUE DE L'ANCIEN MARCHE,0400,53140,53185,Pré-en-Pail-Saint-Samson,53,,,53185000AD0288,,,,,,,,,,,,,0,1,Maison,80,2,S,sols,,,77,-0.198787,48.458964
2021-885406,2021-02-02,000001,Vente,14000,,,RUE DE L'ANCIEN MARCHE,0400,53140,53185,Pré-en-Pail-Saint-Samson,53,,,53185000AD0289,,,,,,,,,,,,,0,,,,,J,jardins,,,118,-0.198691,48.458962
2021-885406,2021-02-02,000001,Vente,14000,,,RUE DE L'ANCIEN MARCHE,0400,53140,53185,Pré-en-Pail-Saint-Samson,53,,,53185000AD0290,,,,,,,,,,,,,0,,,,,J,jardins,,,85,-0.198583,48.458876
2021-885410,2021-01-19,000001,Vente,1000,,,BEAU SOLEIL,C841,53140,53185,Pré-en-Pail-Saint-Samson,53,,,53185252ZL0029,,,,,,,,,,,,,0,,,,,P,prés,,,1000,-0.196522,48.470065
2021-885430,2021-01-19,000002,Vente,807,,,LE PRE DE LA CROIX PRE EN,C246,53140,53185,Pré-en-Pail-Saint-Samson,53,,,53185000YI0470,,,,,,,,,,,,,0,,,,,T,terres,,,807,-0.196552,48.467801
2021-885491,2021-01-25,000001,Vente,30000,103,,RUE ARISTIDE BRIAND,0080,53140,53185,Pré-en-Pail-Saint-Samson,53,,,53185000AD0385,,,,,,,,,,,,,0,1,Maison,157,5,S,sols,,,150,-0.200689,48.459223
2021-885491,2021-01-25,000001,Vente,30000,,,RUE DU CHAMP DE FOIRE,0240,53140,53185,Pré-en-Pail-Saint-Samson,53,,,53185000AD0398,,,,,,,,,,,,,0,,,,,J,jardins,,,192,-0.200505,48.459033
2021-885494,2021-01-27,000001,Vente,131000,17,,LE CLOS PRINCIER,D646,53140,53185,Pré-en-Pail-Saint-Samson,53,,,53185252ZK0158,,,,,,,,,,,,,0,1,Maison,88,5,S,sols,,,926,-0.192456,48.482019
2021-885537,2021-02-02,000001,Vente,50000,125,,LA CENDINIERE,C881,53140,53185,Pré-en-Pail-Saint-Samson,53,,,53185252ZN0071,,,,,,,,,,,,,0,1,Maison,66,3,P,prés,,,2440,,
2021-885537,2021-02-02,000001,Vente,50000,125,,LA CENDINIERE,C881,53140,53185,Pré-en-Pail-Saint-Samson,53,,,53185252ZN0071,,,,,,,,,,,,,0,1,Maison,66,3,J,jardins,POTAG,Jardin potager,1431,,
2021-885537,2021-02-02,000001,Vente,50000,125,,LA CENDINIERE,C881,53140,53185,Pré-en-Pail-Saint-Samson,53,,,53185252ZN0071,,,,,,,,,,,,,0,1,Maison,66,3,VE,vergers,POMME,Pommiers,7450,,
2021-885537,2021-02-02,000001,Vente,50000,125,,LA CENDINIERE,C881,53140,53185,Pré-en-Pail-Saint-Samson,53,,,53185252ZN0071,,,,,,,,,,,,,0,1,Maison,66,3,P,prés,,,35490,,
2021-885537,2021-02-02,000001,Vente,50000,125,,LA CENDINIERE,C881,53140,53185,Pré-en-Pail-Saint-Samson,53,,,53185252ZN0071,,,,,,,,,,,,,0,1,Maison,66,3,T,terres,,,1190,,
2021-885537,2021-02-02,000001,Vente,50000,,,LA CENDINIERE,C881,53140,53185,Pré-en-Pail-Saint-Samson,53,,,53185252ZN0083,,,,,,,,,,,,,0,,,,,S,sols,,,261,-0.213853,48.483916
2021-885537,2021-02-02,000001,Vente,50000,,,LA CENDINIERE,C881,53140,53185,Pré-en-Pail-Saint-Samson,53,,,53185252ZN0084,,,,,,,,,,,,,0,,,,,S,sols,,,114,-0.21413,48.483575
2021-885670,2021-02-18,000001,Vente,79000,2,,RUE STE ANNE,0720,53140,53185,Pré-en-Pail-Saint-Samson,53,,,53185000AD0219,,,,,,,,,,,,,0,2,Appartement,204,6,S,sols,,,382,-0.195976,48.458408
2021-885670,2021-02-18,000001,Vente,79000,2,,RUE STE ANNE,0720,53140,53185,Pré-en-Pail-Saint-Samson,53,,,53185000AD0219,,,,,,,,,,,,,0,2,Appartement,67,1,S,sols,,,382,-0.195976,48.458408
2021-885670,2021-02-18,000001,Vente,79000,2,,RUE STE ANNE,0720,53140,53185,Pré-en-Pail-Saint-Samson,53,,,53185000AD0219,,,,,,,,,,,,,0,2,Appartement,60,2,S,sols,,,382,-0.195976,48.458408
2021-885670,2021-02-18,000001,Vente,79000,2,,RUE STE ANNE,0720,53140,53185,Pré-en-Pail-Saint-Samson,53,,,53185000AD0219,,,,,,,,,,,,,0,3,Dépendance,,0,S,sols,,,382,-0.195976,48.458408
2021-885670,2021-02-18,000001,Vente,79000,,,RUE STE ANNE,0720,53140,53185,Pré-en-Pail-Saint-Samson,53,,,53185000AD0591,,,,,,,,,,,,,0,,,,,P,prés,,,800,-0.195791,48.45852
2021-885772,2021-02-22,000001,Vente,65000,6,B,RUE DE LA BOUCHERIE,0160,53140,53185,Pré-en-Pail-Saint-Samson,53,,,53185000AD0323,,,,,,,,,,,,,0,4,Local industriel. commercial ou assimilé,35,0,S,sols,,,46,-0.198966,48.459317
2021-885772,2021-02-22,000001,Vente,65000,67,,RUE ARISTIDE BRIAND,0080,53140,53185,Pré-en-Pail-Saint-Samson,53,,,53185000AD0329,,,,,,,,,,,,,0,4,Local industriel. commercial ou assimilé,20,0,S,sols,,,39,-0.199207,48.459544
2021-885772,2021-02-22,000001,Vente,65000,67,,RUE ARISTIDE BRIAND,0080,53140,53185,Pré-en-Pail-Saint-Samson,53,,,53185000AD0329,,,,,,,,,,,,,0,1,Maison,76,4,S,sols,,,39,-0.199207,48.459544
2021-885772,2021-02-22,000001,Vente,65000,71,,RUE ARISTIDE BRIAND,0080,53140,53185,Pré-en-Pail-Saint-Samson,53,,,53185000AD0478,,,,,,,,,,,,,0,4,Local industriel. commercial ou assimilé,75,0,S,sols,,,39,-0.199227,48.459325
2021-885772,2021-02-22,000001,Vente,65000,,,RUE AMEDEE FICHET,0060,53140,53185,Pré-en-Pail-Saint-Samson,53,,,53185000AD0550,,,,,,,,,,,,,0,,,,,S,sols,,,10,-0.199391,48.459331
2021-885772,2021-02-22,000001,Vente,65000,,,RUE ARISTIDE BRIAND,0080,53140,53185,Pré-en-Pail-Saint-Samson,53,,,53185000AD0554,,,,,,,,,,,,,0,,,,,S,sols,,,24,-0.199208,48.459482
2021-885772,2021-02-22,000001,Vente,65000,71,B,RUE ARISTIDE BRIAND,0080,53140,53185,Pré-en-Pail-Saint-Samson,53,,,53185000AD0774,,,,,,,,,,,,,0,,,,,S,sols,,,7,-0.199359,48.45933
2021-885905,2021-03-09,000001,Vente,25000,,,LE VAL,C712,53140,53185,Pré-en-Pail-Saint-Samson,53,,,53185000YI0035,,,,,,,,,,,,,0,,,,,J,jardins,,,320,-0.190158,48.470715
2021-885905,2021-03-09,000001,Vente,25000,,,LE VAL,C712,53140,53185,Pré-en-Pail-Saint-Samson,53,,,53185000YI0082,,,,,,,,,,,,,0,,,,,S,sols,,,234,-0.190269,48.470432
2021-885905,2021-03-09,000001,Vente,25000,105,,LE VAL,C712,53140,53185,Pré-en-Pail-Saint-Samson,53,,,53185000YI0083,,,,,,,,,,,,,0,1,Maison,43,2,S,sols,,,744,-0.190277,48.470608
2021-885905,2021-03-09,000001,Vente,25000,,,LE VAL,C712,53140,53185,Pré-en-Pail-Saint-Samson,53,,,53185000YI0084,,,,,,,,,,,,,0,,,,,J,jardins,,,587,-0.1904,48.470772
2021-885946,2021-02-26,000001,Vente,149000,105,,LA PETITE NOE,C086,53140,53185,Pré-en-Pail-Saint-Samson,53,,,53185000ZC0022,,,,,,,,,,,,,0,1,Maison,135,5,J,jardins,,,831,-0.165107,48.421695
2021-885946,2021-02-26,000001,Vente,149000,105,,LA PETITE NOE,C086,53140,53185,Pré-en-Pail-Saint-Samson,53,,,53185000ZC0022,,,,,,,,,,,,,0,1,Maison,135,5,S,sols,,,729,-0.165107,48.421695
2021-886016,2021-02-26,000001,Vente,102000,50,A,RUE DU CHAMP DE FOIRE,0240,53140,53185,Pré-en-Pail-Saint-Samson,53,,,53185000AD0397,,,,,,,,,,,,,0,3,Dépendance,,0,S,sols,,,458,-0.200662,48.458992
2021-886016,2021-02-26,000001,Vente,102000,50,,RUE DU CHAMP DE FOIRE,0240,53140,53185,Pré-en-Pail-Saint-Samson,53,,,53185000AD0403,,,,,,,,,,,,,0,1,Maison,138,5,S,sols,,,194,-0.200815,48.458857
2021-886016,2021-02-26,000001,Vente,102000,,,RUE DU CHAMP DE FOIRE,0240,53140,53185,Pré-en-Pail-Saint-Samson,53,,,53185000AD0701,,,,,,,,,,,,,0,,,,,S,sols,,,65,-0.200884,48.458814
2021-886048,2021-03-10,000001,Vente,66600,,,LES PREAUX,C590,53140,53185,Pré-en-Pail-Saint-Samson,53,,,53185000ZX0062,,,,,,,,,,,,,0,,,,,E,eaux,MARE,Mare,960,-0.236086,48.463438
2021-886048,2021-03-10,000001,Vente,66600,110,,LES PREAUX,C590,53140,53185,Pré-en-Pail-Saint-Samson,53,,,53185000ZX0076,,,,,,,,,,,,,0,1,Maison,70,1,S,sols,,,355,-0.23632,48.463679
2021-886048,2021-03-10,000001,Vente,66600,,,LES PREAUX,C590,53140,53185,Pré-en-Pail-Saint-Samson,53,,,53185000ZX0077,,,,,,,,,,,,,0,,,,,P,prés,,,425,-0.23658,48.46356
2021-886048,2021-03-10,000001,Vente,66600,,,LES PREAUX,C590,53140,53185,Pré-en-Pail-Saint-Samson,53,,,53185000ZX0078,,,,,,,,,,,,,0,,,,,S,sols,,,68,-0.236652,48.463512
2021-886048,2021-03-10,000001,Vente,66600,,,LES PREAUX,C590,53140,53185,Pré-en-Pail-Saint-Samson,53,,,53185000ZX0090,,,,,,,,,,,,,0,,,,,J,jardins,,,445,-0.23662,48.463721
2021-886048,2021-03-10,000001,Vente,66600,,,LE PETIT PRE PRE EN PAIL,C040,53140,53185,Pré-en-Pail-Saint-Samson,53,,,53185000ZX0102,,,,,,,,,,,,,0,,,,,P,prés,,,2335,-0.237007,48.463484
2021-886094,2021-02-26,000001,Vente,4500,,,LE VIEUX ST JULIEN NORD,C757,53140,53185,Pré-en-Pail-Saint-Samson,53,,,53185000ZL0010,,,,,,,,,,,,,0,,,,,T,terres,,,7860,-0.189406,48.428212
2021-886098,2021-03-02,000001,Vente,,,,LE CHATELIER OUEST,C778,53140,53185,Pré-en-Pail-Saint-Samson,53,,,53185000ZS0039,,,,,,,,,,,,,0,,,,,T,terres,,,9500,-0.219351,48.446842
2021-886098,2021-03-02,000001,Vente,,,,LE CHATELIER OUEST,C778,53140,53185,Pré-en-Pail-Saint-Samson,53,,,53185000ZS0039,,,,,,,,,,,,,0,,,,,T,terres,,,9500,-0.219351,48.446842
2021-886098,2021-03-02,000001,Vente,,,,LE CHATELIER OUEST,C778,53140,53185,Pré-en-Pail-Saint-Samson,53,,,53185000ZS0039,,,,,,,,,,,,,0,,,,,L,landes,,,2960,-0.219351,48.446842
2021-886307,2021-03-22,000001,Vente,2367,,,LE TERRIER ROUGE,C688,53140,53185,Pré-en-Pail-Saint-Samson,53,,,53185000ZS0040,,,,,,,,,,,,,0,,,,,T,terres,,,12624,-0.218987,48.448035
2021-886307,2021-03-22,000001,Vente,2367,,,LE TERRIER ROUGE,C688,53140,53185,Pré-en-Pail-Saint-Samson,53,,,53185000ZS0040,,,,,,,,,,,,,0,,,,,T,terres,,,3156,-0.218987,48.448035
2021-886323,2021-03-09,000001,Vente,50000,5227,,LA POUILLOUSE,D294,53140,53185,Pré-en-Pail-Saint-Samson,53,,,53185252ZK0014,,,,,,,,,,,,,0,3,Dépendance,,0,E,eaux,ETANG,Etangs,4321,-0.185741,48.48939
2021-886323,2021-03-09,000001,Vente,50000,5227,,LA POUILLOUSE,D294,53140,53185,Pré-en-Pail-Saint-Samson,53,,,53185252ZK0014,,,,,,,,,,,,,0,3,Dépendance,,0,P,prés,,,4699,-0.185741,48.48939
2021-886323,2021-03-09,000001,Vente,50000,,,LES BRUYERES ST SAMSON,C872,53140,53185,Pré-en-Pail-Saint-Samson,53,,,53185252ZK0017,,,,,,,,,,,,,0,,,,,P,prés,,,330,-0.183739,48.489193
2021-886323,2021-03-09,000001,Vente,50000,,,LES BRUYERES ST SAMSON,C872,53140,53185,Pré-en-Pail-Saint-Samson,53,,,53185252ZK0017,,,,,,,,,,,,,0,,,,,BT,taillis simples,,,2950,-0.183739,48.489193
2021-886383,2021-03-15,000001,Vente,905,,,LE VAL,C712,53140,53185,Pré-en-Pail-Saint-Samson,53,,,53185000YI0460,,,,,,,,,,,,,0,,,,,P,prés,,,52,-0.19676,48.468149
2021-886383,2021-03-15,000001,Vente,905,,,LE VAL,C712,53140,53185,Pré-en-Pail-Saint-Samson,53,,,53185000YI0468,,,,,,,,,,,,,0,,,,,P,prés,,,853,-0.196138,48.470108
2021-886387,2021-03-10,000001,Vente,25000,15,,PL DU CHAMP DE FOIRE,0220,53140,53185,Pré-en-Pail-Saint-Samson,53,,,53185000AC0449,,,,,,,,,,,,,0,3,Dépendance,,0,S,sols,,,302,-0.201414,48.45863
2021-886387,2021-03-10,000001,Vente,25000,15,,PL DU CHAMP DE FOIRE,0220,53140,53185,Pré-en-Pail-Saint-Samson,53,,,53185000AC0449,,,,,,,,,,,,,0,3,Dépendance,,0,S,sols,,,302,-0.201414,48.45863
2021-886387,2021-03-10,000001,Vente,25000,15,,PL DU CHAMP DE FOIRE,0220,53140,53185,Pré-en-Pail-Saint-Samson,53,,,53185000AC0449,,,,,,,,,,,,,0,3,Dépendance,,0,S,sols,,,302,-0.201414,48.45863
2021-886387,2021-03-10,000001,Vente,25000,15,,PL DU CHAMP DE FOIRE,0220,53140,53185,Pré-en-Pail-Saint-Samson,53,,,53185000AC0449,,,,,,,,,,,,,0,3,Dépendance,,0,S,sols,,,302,-0.201414,48.45863
2021-886387,2021-03-10,000001,Vente,25000,15,,PL DU CHAMP DE FOIRE,0220,53140,53185,Pré-en-Pail-Saint-Samson,53,,,53185000AC0449,,,,,,,,,,,,,0,3,Dépendance,,0,S,sols,,,302,-0.201414,48.45863
2021-886387,2021-03-10,000001,Vente,25000,15,,PL DU CHAMP DE FOIRE,0220,53140,53185,Pré-en-Pail-Saint-Samson,53,,,53185000AC0449,,,,,,,,,,,,,0,3,Dépendance,,0,S,sols,,,302,-0.201414,48.45863
2021-886387,2021-03-10,000001,Vente,25000,15,,PL DU CHAMP DE FOIRE,0220,53140,53185,Pré-en-Pail-Saint-Samson,53,,,53185000AC0449,,,,,,,,,,,,,0,3,Dépendance,,0,S,sols,,,302,-0.201414,48.45863
2021-886387,2021-03-10,000001,Vente,25000,15,,PL DU CHAMP DE FOIRE,0220,53140,53185,Pré-en-Pail-Saint-Samson,53,,,53185000AC0449,,,,,,,,,,,,,0,3,Dépendance,,0,S,sols,,,302,-0.201414,48.45863
2021-886591,2021-03-15,000002,Vente,6511.05,,,LA CHEVALLERIE ST SAMSON,C988,53140,53185,Pré-en-Pail-Saint-Samson,53,,,53185252ZE0045,,,,,,,,,,,,,0,,,,,P,prés,,,10,-0.163153,48.494282
2021-886799,2021-03-26,000002,Vente,28536,,,LE PRE VERT,C588,53140,53185,Pré-en-Pail-Saint-Samson,53,,,53185000YO0251,,,,,,,,,,,,,0,,,,,AB,terrains a bâtir,,,4756,-0.187141,48.462209
2021-886817,2021-03-31,000001,Vente,17120,,,LA CAILLARDIERE,B151,53140,53185,Pré-en-Pail-Saint-Samson,53,,,53185000ZP0007,,,,,,,,,,,,,0,,,,,T,terres,,,27843,-0.199894,48.443531
2021-886817,2021-03-31,000001,Vente,17120,,,LA CAILLARDIERE,B151,53140,53185,Pré-en-Pail-Saint-Samson,53,,,53185000ZP0007,,,,,,,,,,,,,0,,,,,L,landes,,,1363,-0.199894,48.443531
2021-886817,2021-03-31,000001,Vente,17120,,,LA CAILLARDIERE,B151,53140,53185,Pré-en-Pail-Saint-Samson,53,,,53185000ZP0007,,,,,,,,,,,,,0,,,,,T,terres,,,3094,-0.199894,48.443531
2021-886877,2021-04-12,000001,Vente,1928,,,LE VAL,C712,53140,53185,Pré-en-Pail-Saint-Samson,53,,,53185000YI0462,,,,,,,,,,,,,0,,,,,P,prés,,,838,-0.197015,48.468625
2021-886877,2021-04-12,000001,Vente,1928,,,LE VAL,C712,53140,53185,Pré-en-Pail-Saint-Samson,53,,,53185000YI0464,,,,,,,,,,,,,0,,,,,P,prés,,,362,-0.197138,48.46916
2021-886877,2021-04-12,000001,Vente,1928,,,LE VAL,C712,53140,53185,Pré-en-Pail-Saint-Samson,53,,,53185000YI0466,,,,,,,,,,,,,0,,,,,P,prés,,,728,-0.19675,48.469623
2021-886879,2021-04-06,000001,Vente,13500,,,LA PETITE VALLEE ST SAMSON,D261,53140,53185,Pré-en-Pail-Saint-Samson,53,,,53185252ZM0059,,,,,,,,,,,,,0,,,,,P,prés,,,36870,-0.20096,48.466642
2021-886879,2021-04-06,000001,Vente,13500,,,LA PETITE VALLEE ST SAMSON,D261,53140,53185,Pré-en-Pail-Saint-Samson,53,,,53185252ZM0059,,,,,,,,,,,,,0,,,,,J,jardins,POTAG,Jardin potager,820,-0.20096,48.466642
2021-886879,2021-04-06,000001,Vente,13500,,,LA PETITE VALLEE ST SAMSON,D261,53140,53185,Pré-en-Pail-Saint-Samson,53,,,53185252ZM0059,,,,,,,,,,,,,0,,,,,S,sols,,,700,-0.20096,48.466642
2021-886958,2021-04-02,000001,Vente,145000,,,LES PETITS CHAMPS PRE EN P,C108,53140,53185,Pré-en-Pail-Saint-Samson,53,,,53185000YE0107,,,,,,,,,,,,,0,,,,,J,jardins,,,401,-0.215593,48.468328
2021-886958,2021-04-02,000001,Vente,145000,,,LES PETITS CHAMPS PRE EN P,C108,53140,53185,Pré-en-Pail-Saint-Samson,53,,,53185000YE0108,,,,,,,,,,,,,0,,,,,S,sols,,,288,-0.215657,48.468384
2021-886958,2021-04-02,000001,Vente,145000,125,,LES PETITS CHAMPS PRE EN P,C108,53140,53185,Pré-en-Pail-Saint-Samson,53,,,53185000YE0109,,,,,,,,,,,,,0,1,Maison,140,4,S,sols,,,182,-0.215714,48.468532
2021-886958,2021-04-02,000001,Vente,145000,125,,LES PETITS CHAMPS PRE EN P,C108,53140,53185,Pré-en-Pail-Saint-Samson,53,,,53185000YE0110,,,,,,,,,,,,,0,,,,,S,sols,,,400,-0.215903,48.468452
2021-886958,2021-04-02,000001,Vente,145000,,,LES PETITS CHAMPS PRE EN P,C108,53140,53185,Pré-en-Pail-Saint-Samson,53,,,53185000YE0111,,,,,,,,,,,,,0,,,,,J,jardins,,,940,-0.21601,48.468341
2021-886959,2021-03-30,000001,Vente,12500,1,,RUE DE L'ANCIEN MARCHE,0400,53140,53185,Pré-en-Pail-Saint-Samson,53,,,53185000AD0284,,,,,,,,,,,,,0,1,Maison,96,5,S,sols,,,201,-0.1986,48.459148
2021-887020,2021-04-15,000001,Vente,83000,12,,RUE DES TROENES,0760,53140,53185,Pré-en-Pail-Saint-Samson,53,,,53185000AC0264,,,,,,,,,,,,,0,1,Maison,76,4,S,sols,,,480,-0.201647,48.46105
2021-887077,2021-04-28,000001,Vente,70001,,,LA MOLLIERE,B912,53140,53185,Pré-en-Pail-Saint-Samson,53,,,53185000YD0009,,,,,,,,,,,,,0,,,,,T,terres,,,3720,-0.247121,48.468676
2021-887077,2021-04-28,000001,Vente,70001,,,LA MOLLIERE,B912,53140,53185,Pré-en-Pail-Saint-Samson,53,,,53185000YD0046,,,,,,,,,,,,,0,,,,,J,jardins,,,260,-0.24694,48.468979
2021-887077,2021-04-28,000001,Vente,70001,110,,LA MOLLIERE,B912,53140,53185,Pré-en-Pail-Saint-Samson,53,,,53185000YD0047,,,,,,,,,,,,,0,3,Dépendance,,0,S,sols,,,316,-0.247123,48.469162
2021-887077,2021-04-28,000001,Vente,70001,110,,LA MOLLIERE,B912,53140,53185,Pré-en-Pail-Saint-Samson,53,,,53185000YD0047,,,,,,,,,,,,,0,3,Dépendance,,0,S,sols,,,316,-0.247123,48.469162
2021-887077,2021-04-28,000001,Vente,70001,110,,LA MOLLIERE,B912,53140,53185,Pré-en-Pail-Saint-Samson,53,,,53185000YD0047,,,,,,,,,,,,,0,1,Maison,53,2,S,sols,,,316,-0.247123,48.469162
2021-887077,2021-04-28,000001,Vente,70001,,,LA MOLLIERE,B912,53140,53185,Pré-en-Pail-Saint-Samson,53,,,53185000YD0060,,,,,,,,,,,,,0,,,,,T,terres,,,28,-0.247239,48.469132
2021-887077,2021-04-28,000001,Vente,70001,,,LA MOLLIERE,B912,53140,53185,Pré-en-Pail-Saint-Samson,53,,,53185000YD0063,,,,,,,,,,,,,0,,,,,P,prés,,,311,-0.247117,48.468983
2021-887317,2021-04-28,000001,Vente,68000,7,,CITE DES LILAS,0335,53140,53185,Pré-en-Pail-Saint-Samson,53,,,53185000AB0080,,,,,,,,,,,,,0,1,Maison,75,4,S,sols,,,348,-0.206713,48.457557
2021-887317,2021-04-28,000001,Vente,68000,,,RTE DE VILLAINES,0820,53140,53185,Pré-en-Pail-Saint-Samson,53,,,53185000AB0081,,,,,,,,,,,,,0,,,,,S,sols,,,432,-0.20686,48.457516
2021-887318,2021-04-21,000001,Vente,100,,,LE GUE DAVID ST SAMSON,D158,53140,53185,Pré-en-Pail-Saint-Samson,53,,,53185252ZH0032,,,,,,,,,,,,,0,,,,,J,jardins,POTAG,Jardin potager,700,-0.153007,48.477184
2021-887319,2021-04-21,000002,Vente,14900,110,,LE GUE DAVID ST SAMSON,D158,53140,53185,Pré-en-Pail-Saint-Samson,53,,,53185252ZH0033,,,,,,,,,,,,,0,1,Maison,36,1,S,sols,,,220,-0.153342,48.477181
2021-887319,2021-04-21,000002,Vente,14900,110,,LE GUE DAVID ST SAMSON,D158,53140,53185,Pré-en-Pail-Saint-Samson,53,,,53185252ZH0033,,,,,,,,,,,,,0,1,Maison,36,1,P,prés,,,1240,-0.153342,48.477181
2021-887320,2021-04-23,000002,Vente,527,,,BEAU SOLEIL,C841,53140,53185,Pré-en-Pail-Saint-Samson,53,,,53185252ZL0167,,,,,,,,,,,,,0,,,,,P,prés,,,527,-0.196386,48.470806
2021-887321,2021-04-23,000001,Vente,147000,4,,LOT DES MERLETTES,0826,53140,53185,Pré-en-Pail-Saint-Samson,53,,,53185252ZL0139,,,,,,,,,,,,,0,1,Maison,98,4,S,sols,,,949,-0.193115,48.481083
2021-887325,2021-04-27,000001,Vente,1000,,,LE GUE DAVID ST SAMSON,D158,53140,53185,Pré-en-Pail-Saint-Samson,53,,,53185252ZH0040,,,,,,,,,,,,,0,,,,,J,jardins,POTAG,Jardin potager,1120,-0.153414,48.47792
2021-887326,2021-04-27,000002,Vente,79000,105,,LE GUE DAVID ST SAMSON,D158,53140,53185,Pré-en-Pail-Saint-Samson,53,,,53185252ZH0041,,,,,,,,,,,,,0,1,Maison,72,4,S,sols,,,780,-0.152969,48.477758
2021-887326,2021-04-27,000002,Vente,79000,,,LE GUE DAVID ST SAMSON,D158,53140,53185,Pré-en-Pail-Saint-Samson,53,,,53185252ZH0042,,,,,,,,,,,,,0,,,,,S,sols,,,240,-0.152804,48.477737
2021-887354,2021-05-11,000001,Vente,27880.2,,,LE MAUJOURNAL,B895,53140,53185,Pré-en-Pail-Saint-Samson,53,,,53185000YC0010,,,,,,,,,,,,,0,,,,,T,terres,,,25280,-0.241105,48.478136
2021-887354,2021-05-11,000001,Vente,27880.2,,,LE FOUILLARDET,B546,53140,53185,Pré-en-Pail-Saint-Samson,53,,,53185000YC0092,,,,,,,,,,,,,0,,,,,T,terres,,,36676,-0.239957,48.475427
2021-887387,2021-05-11,000001,Vente,21118.5,,,LES CHESNOTS,B373,53140,53185,Pré-en-Pail-Saint-Samson,53,,,53185000YC0023,,,,,,,,,,,,,0,,,,,T,terres,,,5430,-0.234412,48.474167
2021-887387,2021-05-11,000001,Vente,21118.5,,,LES CHESNOTS,B373,53140,53185,Pré-en-Pail-Saint-Samson,53,,,53185000YC0023,,,,,,,,,,,,,0,,,,,P,prés,,,1333,-0.234412,48.474167
2021-887387,2021-05-11,000001,Vente,21118.5,,,LES CHESNOTS,B373,53140,53185,Pré-en-Pail-Saint-Samson,53,,,53185000YC0023,,,,,,,,,,,,,0,,,,,P,prés,,,1177,-0.234412,48.474167
2021-887387,2021-05-11,000001,Vente,21118.5,,,LES CHESNOTS,B373,53140,53185,Pré-en-Pail-Saint-Samson,53,,,53185000YC0023,,,,,,,,,,,,,0,,,,,P,prés,,,2667,-0.234412,48.474167
2021-887387,2021-05-11,000001,Vente,21118.5,,,LES CHESNOTS,B373,53140,53185,Pré-en-Pail-Saint-Samson,53,,,53185000YC0023,,,,,,,,,,,,,0,,,,,P,prés,,,2667,-0.234412,48.474167
2021-887387,2021-05-11,000001,Vente,21118.5,,,LES CHESNOTS,B373,53140,53185,Pré-en-Pail-Saint-Samson,53,,,53185000YC0023,,,,,,,,,,,,,0,,,,,P,prés,,,1177,-0.234412,48.474167
2021-887387,2021-05-11,000001,Vente,21118.5,,,LES CHESNOTS,B373,53140,53185,Pré-en-Pail-Saint-Samson,53,,,53185000YC0023,,,,,,,,,,,,,0,,,,,T,terres,,,5869,-0.234412,48.474167
2021-887387,2021-05-11,000001,Vente,21118.5,,,LES CHESNOTS,B373,53140,53185,Pré-en-Pail-Saint-Samson,53,,,53185000YC0024,,,,,,,,,,,,,0,,,,,P,prés,,,2292,-0.233516,48.474767