id_mutation,date_mutation,numero_disposition,nature_mutation,valeur_fonciere,adresse_numero,adresse_suffixe,adresse_nom_voie,adresse_code_voie,code_postal,code_commune,nom_commune,code_departement,ancien_code_commune,ancien_nom_commune,id_parcelle,ancien_id_parcelle,numero_volume,lot1_numero,lot1_surface_carrez,lot2_numero,lot2_surface_carrez,lot3_numero,lot3_surface_carrez,lot4_numero,lot4_surface_carrez,lot5_numero,lot5_surface_carrez,nombre_lots,code_type_local,type_local,surface_reelle_bati,nombre_pieces_principales,code_nature_culture,nature_culture,code_nature_culture_speciale,nature_culture_speciale,surface_terrain,longitude,latitude
2021-885442,2021-02-03,000002,Vente,100000,1,,LE BAS HAZAY,B009,53110,53189,Rennes-en-Grenouilles,53,,,53189000ZD0130,,,,,,,,,,,,,0,1,Maison,81,4,,,,,,-0.490718,48.501257
2021-888909,2021-07-01,000002,Vente,46240.15,,,LA GUIBERDIERE,B218,53110,53189,Rennes-en-Grenouilles,53,,,53189000ZC0072,,,,,,,,,,,,,0,,,,,P,prés,,,1255,-0.494612,48.486603
2021-888909,2021-07-01,000002,Vente,46240.15,,,LA GUIBERDIERE,B218,53110,53189,Rennes-en-Grenouilles,53,,,53189000ZC0072,,,,,,,,,,,,,0,,,,,P,prés,,,1255,-0.494612,48.486603
2021-891509,2021-09-30,000001,Vente,70000,5,,LE SAUSSAY,B430,53110,53189,Rennes-en-Grenouilles,53,,,53189000ZA0036,,,,,,,,,,,,,0,3,Dépendance,,0,S,sols,,,1079,-0.527536,48.488811
2021-891509,2021-09-30,000001,Vente,70000,5,,LE SAUSSAY,B430,53110,53189,Rennes-en-Grenouilles,53,,,53189000ZA0036,,,,,,,,,,,,,0,1,Maison,130,6,S,sols,,,1079,-0.527536,48.488811
2021-891509,2021-09-30,000001,Vente,70000,,,LE SAUSSAY,B430,53110,53189,Rennes-en-Grenouilles,53,,,53189000ZA0070,,,,,,,,,,,,,0,,,,,P,prés,,,108,-0.527279,48.488591
2021-891509,2021-09-30,000001,Vente,70000,,,LE SAUSSAY,B430,53110,53189,Rennes-en-Grenouilles,53,,,53189000ZA0071,,,,,,,,,,,,,0,,,,,P,prés,,,140,-0.527581,48.488697
2021-893089,2021-11-25,000001,Vente,50000,6,,LA VIEILLE PESLIERE,B454,53110,53189,Rennes-en-Grenouilles,53,,,53189000ZC0056,,,,,,,,,,,,,0,1,Maison,45,2,S,sols,,,988,-0.504408,48.481912
2021-893089,2021-11-25,000001,Vente,50000,6,,LA VIEILLE PESLIERE,B454,53110,53189,Rennes-en-Grenouilles,53,,,53189000ZC0056,,,,,,,,,,,,,0,1,Maison,45,2,T,terres,,,706,-0.504408,48.481912
2021-893089,2021-11-25,000001,Vente,50000,6,,LA VIEILLE PESLIERE,B454,53110,53189,Rennes-en-Grenouilles,53,,,53189000ZC0056,,,,,,,,,,,,,0,1,Maison,45,2,VE,vergers,POMME,Pommiers,760,-0.504408,48.481912
