id_mutation,date_mutation,numero_disposition,nature_mutation,valeur_fonciere,adresse_numero,adresse_suffixe,adresse_nom_voie,adresse_code_voie,code_postal,code_commune,nom_commune,code_departement,ancien_code_commune,ancien_nom_commune,id_parcelle,ancien_id_parcelle,numero_volume,lot1_numero,lot1_surface_carrez,lot2_numero,lot2_surface_carrez,lot3_numero,lot3_surface_carrez,lot4_numero,lot4_surface_carrez,lot5_numero,lot5_surface_carrez,nombre_lots,code_type_local,type_local,surface_reelle_bati,nombre_pieces_principales,code_nature_culture,nature_culture,code_nature_culture_speciale,nature_culture_speciale,surface_terrain,longitude,latitude
2021-884936,2021-01-15,000003,Vente,50,,,LA LANDE,B460,53240,53229,Saint-Jean-sur-Mayenne,53,,,532290000A1970,,,,,,,,,,,,,0,,,,,P,prés,,,21,-0.781036,48.137228
2021-884936,2021-01-15,000003,Vente,50,,,LE BAS QUIFEU,B025,53240,53229,Saint-Jean-sur-Mayenne,53,,,532290000A1971,,,,,,,,,,,,,0,,,,,P,prés,,,16,-0.781025,48.137207
2021-884957,2021-01-11,000001,Vente,48365,1,,IMP DES MAGNOLIAS,0086,53240,53229,Saint-Jean-sur-Mayenne,53,,,532290000A2012,,,,,,,,,,,,,0,,,,,AB,terrains a bâtir,,,569,-0.763702,48.135951
2021-884958,2021-01-25,000001,Vente,45645,40,,RUE DES CHARMES,0021,53240,53229,Saint-Jean-sur-Mayenne,53,,,532290000A2001,,,,,,,,,,,,,0,,,,,AB,terrains a bâtir,,,537,-0.763511,48.135223
2021-885110,2021-01-07,000001,Vente,40000,,,LE CLOSEAU DE L AIRE,B251,53240,53229,Saint-Jean-sur-Mayenne,53,,,532290000C0098,,,,,,,,,,,,,0,,,,,P,prés,,,2010,-0.780405,48.13281
2021-885110,2021-01-07,000001,Vente,40000,,,L ASNERIE,B012,53240,53229,Saint-Jean-sur-Mayenne,53,,,532290000C0643,,,,,,,,,,,,,0,,,,,S,sols,,,589,-0.780577,48.133322
2021-885122,2021-01-26,000001,Vente,170500,1,,IMP DE LA BOISTARDIERE,0014,53240,53229,Saint-Jean-sur-Mayenne,53,,,53229000AC0072,,,,,,,,,,,,,0,1,Maison,82,4,S,sols,,,957,-0.755248,48.128506
2021-885462,2021-02-12,000001,Vente,52800,34,,RUE DES CHARMES,0021,53240,53229,Saint-Jean-sur-Mayenne,53,,,532290000A2004,,,,,,,,,,,,,0,,,,,AB,terrains a bâtir,,,660,-0.763643,48.135477
2021-885771,2021-02-17,000001,Vente,50130,9,,RUE DES CHARMES,0021,53240,53229,Saint-Jean-sur-Mayenne,53,,,532290000A1987,,,,,,,,,,,,,0,,,,,AB,terrains a bâtir,,,557,-0.761568,48.135721
2021-885798,2021-02-22,000001,Vente,49385,42,,RUE DE LA PERRIERE,0112,53240,53229,Saint-Jean-sur-Mayenne,53,,,53229000AB0197,,,,,,,,,,,,,0,,,,,AB,terrains a bâtir,,,465,-0.759457,48.134321
2021-885798,2021-02-22,000001,Vente,49385,42,,RUE DE LA PERRIERE,0112,53240,53229,Saint-Jean-sur-Mayenne,53,,,53229000AB0199,,,,,,,,,,,,,0,,,,,AB,terrains a bâtir,,,116,-0.759335,48.134292
2021-885799,2021-02-19,000001,Vente,48365,36,,RUE DE LA PERRIERE,0112,53240,53229,Saint-Jean-sur-Mayenne,53,,,53229000AB0202,,,,,,,,,,,,,0,,,,,AB,terrains a bâtir,,,569,-0.758697,48.134296
2021-885830,2021-02-26,000001,Vente,255000,9,,RUE DES SAULES,0120,53240,53229,Saint-Jean-sur-Mayenne,53,,,53229000AC0137,,,,,,,,,,,,,0,1,Maison,119,4,S,sols,,,621,-0.756982,48.128201
2021-885857,2021-02-19,000001,Vente,302680,23,,RUE DE FOUILLOUX,0030,53240,53229,Saint-Jean-sur-Mayenne,53,,,53229000AA0194,,,,,,,,,,,,,0,1,Maison,111,4,S,sols,,,817,-0.758389,48.13612
2021-885930,2021-03-11,000001,Vente,52830,20,,RUE DES CHARMES,0021,53240,53229,Saint-Jean-sur-Mayenne,53,,,532290000A1981,,,,,,,,,,,,,0,,,,,AB,terrains a bâtir,,,587,-0.763101,48.136163
2021-886022,2021-01-15,000001,Adjudication,56000,23,,RUE MAURICE COURCELLE,0095,53240,53229,Saint-Jean-sur-Mayenne,53,,,53229000AB0171,,,,,,,,,,,,,0,1,Maison,75,4,S,sols,,,225,-0.75244,48.130869
2021-886022,2021-01-15,000001,Adjudication,56000,23,,RUE MAURICE COURCELLE,0095,53240,53229,Saint-Jean-sur-Mayenne,53,,,53229000AB0172,,2,,,,,,,,,,,0,,,,,,,,,,-0.752226,48.130925
2021-886300,2021-03-29,000001,Vente,53190,14,,RUE DES CHARMES,0021,53240,53229,Saint-Jean-sur-Mayenne,53,,,532290000A1978,,,,,,,,,,,,,0,,,,,AB,terrains a bâtir,,,591,-0.762283,48.13613
2021-886301,2021-03-29,000001,Vente,46170,,,LES GRANDES MEES,B395,53240,53229,Saint-Jean-sur-Mayenne,53,,,532290000A1989,,,,,,,,,,,,,0,,,,,AB,terrains a bâtir,,,513,-0.761495,48.135463
2021-886311,2021-03-22,000001,Vente,49320,44,,RUE DES CHARMES,0021,53240,53229,Saint-Jean-sur-Mayenne,53,,,532290000A1999,,,,,,,,,,,,,0,,,,,AB,terrains a bâtir,,,548,-0.762924,48.135199
2021-886616,2021-03-29,000001,Vente,35000,,,LE CHEM D EXPLOITATION,B194,53240,53229,Saint-Jean-sur-Mayenne,53,,,532290000A0331,,,,,,,,,,,,,0,,,,,P,prés,,,240,-0.775915,48.14184
2021-886616,2021-03-29,000001,Vente,35000,,,LE PRE DU GUE,B698,53240,53229,Saint-Jean-sur-Mayenne,53,,,532290000A0333,,,,,,,,,,,,,0,,,,,VE,vergers,POMME,Pommiers,5079,-0.775978,48.142275
2021-886616,2021-03-29,000001,Vente,35000,1331,,RTE DE LA ROUILLERIE,0179,53240,53229,Saint-Jean-sur-Mayenne,53,,,532290000A0334,,,,,,,,,,,,,0,1,Maison,15,1,S,sols,,,268,-0.776391,48.141883
2021-886616,2021-03-29,000001,Vente,35000,1331,,RTE DE LA ROUILLERIE,0179,53240,53229,Saint-Jean-sur-Mayenne,53,,,532290000A0334,,,,,,,,,,,,,0,1,Maison,15,1,P,prés,,,1300,-0.776391,48.141883
2021-886616,2021-03-29,000001,Vente,35000,,,LE VALLON,B789,53240,53229,Saint-Jean-sur-Mayenne,53,,,532290000A0335,,,,,,,,,,,,,0,,,,,BT,taillis simples,,,210,-0.777022,48.141909
2021-886616,2021-03-29,000001,Vente,35000,,,LE CHEM D EXPLOITATION,B194,53240,53229,Saint-Jean-sur-Mayenne,53,,,532290000A1710,,,,,,,,,,,,,0,,,,,P,prés,,,91,-0.776812,48.141921
2021-886628,2021-03-29,000001,Vente,60000,39,,CHE DE LA MOYETTE,0146,53240,53229,Saint-Jean-sur-Mayenne,53,,,53229000ZA0035,,,,,,,,,,,,,0,1,Maison,48,2,S,sols,,,84,-0.77322,48.122262
2021-886714,2021-04-02,000001,Vente,265000,,,LE VERGER,B798,53240,53229,Saint-Jean-sur-Mayenne,53,,,532290000A0680,,,,,,,,,,,,,0,,,,,VE,vergers,POMME,Pommiers,1326,-0.763376,48.143574
2021-886714,2021-04-02,000001,Vente,265000,,,LA NOE,B520,53240,53229,Saint-Jean-sur-Mayenne,53,,,532290000A0681,,,,,,,,,,,,,0,,,,,P,prés,,,5812,-0.763001,48.14278
2021-886714,2021-04-02,000001,Vente,265000,,,TERRE DE DERRIERE,B776,53240,53229,Saint-Jean-sur-Mayenne,53,,,532290000A1871,,,,,,,,,,,,,0,,,,,T,terres,,,2031,-0.763472,48.14322
2021-886714,2021-04-02,000001,Vente,265000,,,LE JOUR,B458,53240,53229,Saint-Jean-sur-Mayenne,53,,,532290000A1873,,,,,,,,,,,,,0,,,,,T,terres,,,291,-0.762512,48.143264
2021-886714,2021-04-02,000001,Vente,265000,,,LA GRIPELLIERE,B399,53240,53229,Saint-Jean-sur-Mayenne,53,,,532290000A1877,,,,,,,,,,,,,0,,,,,J,jardins,,,1845,-0.762416,48.143388
2021-886714,2021-04-02,000001,Vente,265000,1060,,CHE DE REHARD,0151,53240,53229,Saint-Jean-sur-Mayenne,53,,,532290000A1878,,,,,,,,,,,,,0,3,Dépendance,,0,S,sols,,,3524,-0.763212,48.143776
2021-886714,2021-04-02,000001,Vente,265000,1060,,CHE DE REHARD,0151,53240,53229,Saint-Jean-sur-Mayenne,53,,,532290000A1878,,,,,,,,,,,,,0,3,Dépendance,,0,S,sols,,,3524,-0.763212,48.143776
2021-886714,2021-04-02,000001,Vente,265000,1060,,CHE DE REHARD,0151,53240,53229,Saint-Jean-sur-Mayenne,53,,,532290000A1878,,,,,,,,,,,,,0,1,Maison,190,6,S,sols,,,3524,-0.763212,48.143776
2021-886714,2021-04-02,000001,Vente,265000,,,LA GRIPELLIERE,B399,53240,53229,Saint-Jean-sur-Mayenne,53,,,532290000A1880,,,,,,,,,,,,,0,,,,,T,terres,,,220,-0.762281,48.143591
2021-886714,2021-04-02,000001,Vente,265000,,,LE CHAMP DE DEVANT,B107,53240,53229,Saint-Jean-sur-Mayenne,53,,,532290000A1882,,,,,,,,,,,,,0,,,,,T,terres,,,2290,-0.763071,48.143871
2021-886865,2021-04-01,000001,Vente,51300,21,,RUE DES CHARMES,0021,53240,53229,Saint-Jean-sur-Mayenne,53,,,532290000A2023,,,,,,,,,,,,,0,,,,,AB,terrains a bâtir,,,570,-0.7633,48.135942
2021-887047,2021-04-26,000001,Vente,37520,29,,RUE DES CHARMES,0021,53240,53229,Saint-Jean-sur-Mayenne,53,,,532290000A1996,,,,,,,,,,,,,0,,,,,AB,terrains a bâtir,,,536,-0.762595,48.135573
2021-887054,2021-04-12,000001,Vente,47520,30,,RUE DES CHARMES,0021,53240,53229,Saint-Jean-sur-Mayenne,53,,,532290000A2008,,,,,,,,,,,,,0,,,,,AB,terrains a bâtir,,,528,-0.764388,48.135584
2021-887075,2021-04-14,000001,Vente,47855,34,,RUE DE LA PERRIERE,0112,53240,53229,Saint-Jean-sur-Mayenne,53,,,53229000AB0203,,,,,,,,,,,,,0,,,,,AB,terrains a bâtir,,,563,-0.758465,48.134287
2021-887086,2021-04-08,000001,Vente,210000,217,,CHE DU HALAGE,0166,53240,53229,Saint-Jean-sur-Mayenne,53,,,532290000B0517,,,,,,,,,,,,,0,3,Dépendance,,0,S,sols,,,371,-0.749514,48.127931
2021-887086,2021-04-08,000001,Vente,210000,217,,CHE DU HALAGE,0166,53240,53229,Saint-Jean-sur-Mayenne,53,,,532290000B0517,,,,,,,,,,,,,0,1,Maison,144,5,S,sols,,,371,-0.749514,48.127931
2021-887086,2021-04-08,000001,Vente,210000,,,LA GRANDE CHAINTRE,B377,53240,53229,Saint-Jean-sur-Mayenne,53,,,532290000B0561,,,,,,,,,,,,,0,,,,,S,sols,,,498,-0.749372,48.127964
2021-887086,2021-04-08,000001,Vente,210000,,,LA PETITE CHAINTRE,B594,53240,53229,Saint-Jean-sur-Mayenne,53,,,532290000B1042,,,,,,,,,,,,,0,,,,,S,sols,,,87,-0.749445,48.127787
2021-887154,2021-04-15,000001,Vente,270000,,,LE JARDIN DU RONCERAY,B454,53240,53229,Saint-Jean-sur-Mayenne,53,,,532290000B0191,,,,,,,,,,,,,0,,,,,J,jardins,,,1026,-0.74512,48.141312
2021-887154,2021-04-15,000001,Vente,270000,272,,CHE DU RONCERAY,0170,53240,53229,Saint-Jean-sur-Mayenne,53,,,532290000B0707,,,,,,,,,,,,,0,1,Maison,216,4,S,sols,,,697,-0.74512,48.141533
2021-887232,2021-04-26,000001,Vente,50940,32,,RUE DE LA PERRIERE,0112,53240,53229,Saint-Jean-sur-Mayenne,53,,,53229000AB0204,,,,,,,,,,,,,0,,,,,AB,terrains a bâtir,,,566,-0.758208,48.134277
2021-887248,2021-04-09,000001,Vente,226320,15,,RUE DE L'AUBEPINE,0831,53240,53229,Saint-Jean-sur-Mayenne,53,,,532290000A1924,,,,,,,,,,,,,0,1,Maison,99,5,S,sols,,,378,-0.760578,48.134187
2021-887392,2021-05-04,000001,Vente,58860,44,,RUE DE LA PERRIERE,0112,53240,53229,Saint-Jean-sur-Mayenne,53,,,53229000AB0198,,,,,,,,,,,,,0,,,,,AB,terrains a bâtir,,,654,-0.759662,48.134314
2021-887474,2021-05-11,000001,Vente,130000,,,LE VALLON,B789,53240,53229,Saint-Jean-sur-Mayenne,53,,,532290000A0378,,,,,,,,,,,,,0,,,,,P,prés,,,922,-0.777613,48.141976
2021-887474,2021-05-11,000001,Vente,130000,142,,CHE DES QUENTINIERES,0162,53240,53229,Saint-Jean-sur-Mayenne,53,,,532290000A1116,,,,,,,,,,,,,0,1,Maison,60,3,S,sols,,,205,-0.777977,48.141807
2021-887474,2021-05-11,000001,Vente,130000,,,LE GRAND JARDIN,B364,53240,53229,Saint-Jean-sur-Mayenne,53,,,532290000A1225,,,,,,,,,,,,,0,,,,,P,prés,,,105,-0.778079,48.141855
2021-887478,2021-04-30,000002,Vente,56000,,,RUE MAURICE COURCELLE,0095,53240,53229,Saint-Jean-sur-Mayenne,53,,,53229000AB0211,,,,,,,,,,,,,0,,,,,S,sols,,,372,-0.751492,48.130941
2021-887514,2021-04-30,000002,Vente,327000,5260,,LA GOULLIERE,B344,53240,53229,Saint-Jean-sur-Mayenne,53,,,53229000ZA0050,,,,,,,,,,,,,0,2,Appartement,45,1,,,,,,-0.776413,48.12789
2021-887514,2021-04-30,000002,Vente,327000,5260,,LA GOULLIERE,B344,53240,53229,Saint-Jean-sur-Mayenne,53,,,53229000ZA0050,,,,,,,,,,,,,0,2,Appartement,39,2,,,,,,-0.776413,48.12789
2021-887514,2021-04-30,000002,Vente,327000,5260,,LA GOULLIERE,B344,53240,53229,Saint-Jean-sur-Mayenne,53,,,53229000ZA0050,,,,,,,,,,,,,0,2,Appartement,101,3,,,,,,-0.776413,48.12789
2021-887514,2021-04-30,000002,Vente,327000,5260,,LA GOULLIERE,B344,53240,53229,Saint-Jean-sur-Mayenne,53,,,53229000ZA0050,,,,,,,,,,,,,0,2,Appartement,78,3,,,,,,-0.776413,48.12789
2021-887514,2021-04-30,000002,Vente,327000,5260,,LA GOULLIERE,B344,53240,53229,Saint-Jean-sur-Mayenne,53,,,53229000ZA0050,,,,,,,,,,,,,0,3,Dépendance,,0,,,,,,-0.776413,48.12789
2021-887514,2021-04-30,000002,Vente,327000,5260,,LA GOULLIERE,B344,53240,53229,Saint-Jean-sur-Mayenne,53,,,53229000ZA0050,,,,,,,,,,,,,0,2,Appartement,51,2,,,,,,-0.776413,48.12789
2021-887514,2021-04-30,000002,Vente,327000,5260,,LA GOULLIERE,B344,53240,53229,Saint-Jean-sur-Mayenne,53,,,53229000ZA0050,,,,,,,,,,,,,0,2,Appartement,59,3,,,,,,-0.776413,48.12789
2021-887640,2021-05-05,000001,Vente,1,2,A,RUE DU PORT,0186,53240,53229,Saint-Jean-sur-Mayenne,53,,,53229000AB0051,,,,,,,,,,,,,0,1,Maison,62,3,S,sols,,,785,-0.752269,48.132899
2021-887640,2021-05-05,000001,Vente,1,,,LES PORTS,B629,53240,53229,Saint-Jean-sur-Mayenne,53,,,53229000AB0168,,,,,,,,,,,,,0,,,,,S,sols,,,256,-0.751807,48.132897
2021-887640,2021-05-05,000001,Vente,1,2,,RUE DE LA MAIRIE,0088,53240,53229,Saint-Jean-sur-Mayenne,53,,,53229000AB0188,,,,,,,,,,,,,0,,,,,S,sols,,,42,-0.751708,48.13267
2021-887640,2021-05-05,000001,Vente,1,5084,,LE BOURG,B064,53240,53229,Saint-Jean-sur-Mayenne,53,,,53229000AB0193,,,,,,,,,,,,,0,3,Dépendance,,0,S,sols,,,1704,-0.751984,48.132602
2021-887641,2021-05-07,000001,Vente,47090,42,,RUE DES CHARMES,0021,53240,53229,Saint-Jean-sur-Mayenne,53,,,532290000A2000,,,,,,,,,,,,,0,,,,,AB,terrains a bâtir,,,554,-0.763222,48.135211
2021-888097,2021-06-07,000001,Vente,95000,26,,RUE MAURICE COURCELLE,0095,53240,53229,Saint-Jean-sur-Mayenne,53,,,53229000AB0092,,,2,,6,,,,,,,,2,3,Dépendance,,0,,,,,,-0.751833,48.130784
2021-888097,2021-06-07,000001,Vente,95000,26,,RUE MAURICE COURCELLE,0095,53240,53229,Saint-Jean-sur-Mayenne,53,,,53229000AB0092,,,2,,6,,,,,,,,2,2,Appartement,44,2,,,,,,-0.751833,48.130784
2021-888097,2021-06-07,000001,Vente,95000,24,,RUE MAURICE COURCELLE,0095,53240,53229,Saint-Jean-sur-Mayenne,53,,,53229000AB0092,,,10,,13,,5,,,,,,3,2,Appartement,80,4,,,,,,-0.751833,48.130784
2021-888097,2021-06-07,000001,Vente,95000,24,,RUE MAURICE COURCELLE,0095,53240,53229,Saint-Jean-sur-Mayenne,53,,,53229000AB0092,,,10,,13,,5,,,,,,3,3,Dépendance,,0,,,,,,-0.751833,48.130784
2021-888097,2021-06-07,000001,Vente,95000,24,,RUE MAURICE COURCELLE,0095,53240,53229,Saint-Jean-sur-Mayenne,53,,,53229000AB0092,,,10,,13,,5,,,,,,3,3,Dépendance,,0,,,,,,-0.751833,48.130784
2021-888097,2021-06-07,000001,Vente,95000,,,RUE MAURICE COURCELLE,0095,53240,53229,Saint-Jean-sur-Mayenne,53,,,53229000AB0213,,,,,,,,,,,,,0,,,,,S,sols,,,14,-0.751746,48.130722
2021-888097,2021-06-07,000001,Vente,95000,,,RUE MAURICE COURCELLE,0095,53240,53229,Saint-Jean-sur-Mayenne,53,,,53229000AB0214,,,,,,,,,,,,,0,,,,,S,sols,,,15,-0.751602,48.130699
2021-888196,2021-06-09,000001,Vente,47700,17,,RUE DES CHARMES,0021,53240,53229,Saint-Jean-sur-Mayenne,53,,,532290000A1983,,,,,,,,,,,,,0,,,,,AB,terrains a bâtir,,,530,-0.762788,48.13592
2021-888868,2021-07-01,000001,Vente,47700,19,,RUE DES CHARMES,0021,53240,53229,Saint-Jean-sur-Mayenne,53,,,532290000A1982,,,,,,,,,,,,,0,,,,,AB,terrains a bâtir,,,530,-0.763053,48.135948
2021-889051,2021-06-23,000001,Vente,45810,4,,IMP DES AMANDIERS,0007,53240,53229,Saint-Jean-sur-Mayenne,53,,,532290000A1994,,,,,,,,,,,,,0,,,,,AB,terrains a bâtir,,,509,-0.761958,48.135309
2021-889067,2021-07-07,000001,Vente,225000,45,,IMP DES PETITES MEES,0175,53240,53229,Saint-Jean-sur-Mayenne,53,,,532290000A1840,,,,,,,,,,,,,0,3,Dépendance,,0,S,sols,,,500,-0.761841,48.137074
2021-889067,2021-07-07,000001,Vente,225000,45,,IMP DES PETITES MEES,0175,53240,53229,Saint-Jean-sur-Mayenne,53,,,532290000A1840,,,,,,,,,,,,,0,3,Dépendance,,0,AG,terrains d'agrément,PARC,Parc,500,-0.761841,48.137074
2021-889067,2021-07-07,000001,Vente,225000,45,,IMP DES PETITES MEES,0175,53240,53229,Saint-Jean-sur-Mayenne,53,,,532290000A1840,,,,,,,,,,,,,0,3,Dépendance,,0,AG,terrains d'agrément,PARC,Parc,500,-0.761841,48.137074
2021-889067,2021-07-07,000001,Vente,225000,45,,IMP DES PETITES MEES,0175,53240,53229,Saint-Jean-sur-Mayenne,53,,,532290000A1840,,,,,,,,,,,,,0,1,Maison,120,4,AG,terrains d'agrément,PARC,Parc,500,-0.761841,48.137074
2021-889067,2021-07-07,000001,Vente,225000,45,,IMP DES PETITES MEES,0175,53240,53229,Saint-Jean-sur-Mayenne,53,,,532290000A1840,,,,,,,,,,,,,0,3,Dépendance,,0,S,sols,,,500,-0.761841,48.137074
2021-889067,2021-07-07,000001,Vente,225000,45,,IMP DES PETITES MEES,0175,53240,53229,Saint-Jean-sur-Mayenne,53,,,532290000A1840,,,,,,,,,,,,,0,1,Maison,120,4,S,sols,,,500,-0.761841,48.137074
2021-889109,2021-07-01,000001,Vente,220000,13,,RUE DU BOCAGE,0012,53240,53229,Saint-Jean-sur-Mayenne,53,,,53229000AC0064,,,,,,,,,,,,,0,1,Maison,93,4,S,sols,,,524,-0.756915,48.127443
2021-889134,2021-07-08,000001,Vente,44625,32,,RUE DES CHARMES,0021,53240,53229,Saint-Jean-sur-Mayenne,53,,,532290000A2007,,,,,,,,,,,,,0,,,,,AB,terrains a bâtir,,,525,-0.764451,48.135418
2021-889610,2021-07-09,000001,Vente,4500,17,,RUE MAURICE COURCELLE,0095,53240,53229,Saint-Jean-sur-Mayenne,53,,,53229000AB0162,,,,,,,,,,,,,0,,,,,J,jardins,,,116,-0.752383,48.130529
2021-889659,2021-07-28,000001,Vente,260000,,,LA NOE DE LA PLANCHE,B523,53240,53229,Saint-Jean-sur-Mayenne,53,,,532290000A0259,,,,,,,,,,,,,0,,,,,P,prés,,,1150,-0.774156,48.142035
2021-889659,2021-07-28,000001,Vente,260000,1420,,RTE DE LA ROUILLERIE,0179,53240,53229,Saint-Jean-sur-Mayenne,53,,,532290000A0324,,,,,,,,,,,,,0,1,Maison,179,8,S,sols,,,1281,-0.774417,48.141679
2021-889659,2021-07-28,000001,Vente,260000,,,LA VALLEE,B784,53240,53229,Saint-Jean-sur-Mayenne,53,,,532290000A0325,,,,,,,,,,,,,0,,,,,P,prés,,,978,-0.774907,48.141694
2021-889777,2021-07-30,000001,Vente,228500,9,,RUE DE L'AUBEPINE,0831,53240,53229,Saint-Jean-sur-Mayenne,53,,,53229000AA0251,,,,,,,,,,,,,0,1,Maison,104,4,S,sols,,,492,-0.760722,48.134931
2021-890192,2021-08-20,000001,Vente,195000,17,,RUE DE L'AUBEPINE,0831,53240,53229,Saint-Jean-sur-Mayenne,53,,,532290000A1925,,,,,,,,,,,,,0,1,Maison,90,5,S,sols,,,329,-0.760298,48.134182
2021-890385,2021-08-23,000001,Vente,175500,1,,RUE DE L'AUBEPINE,0831,53240,53229,Saint-Jean-sur-Mayenne,53,,,53229000AA0254,,,,,,,,,,,,,0,1,Maison,77,3,S,sols,,,515,-0.760468,48.135832
2021-890521,2021-09-01,000001,Vente,51530,2,,IMP DES MAGNOLIAS,0086,53240,53229,Saint-Jean-sur-Mayenne,53,,,532290000A2019,,,,,,,,,,,,,0,,,,,AB,terrains a bâtir,,,570,-0.763603,48.136249
2021-890521,2021-09-01,000001,Vente,51530,2,,IMP DES MAGNOLIAS,0086,53240,53229,Saint-Jean-sur-Mayenne,53,,,532290000A2020,,,,,,,,,,,,,0,,,,,AB,terrains a bâtir,,,23,-0.763538,48.136395
2021-890768,2021-09-13,000001,Vente,49590,7,,RUE DES CHARMES,0021,53240,53229,Saint-Jean-sur-Mayenne,53,,,532290000A1988,,,,,,,,,,,,,0,,,,,AB,terrains a bâtir,,,551,-0.761341,48.13572
2021-890886,2021-09-13,000001,Vente,295500,,,L AME,B009,53240,53229,Saint-Jean-sur-Mayenne,53,,,532290000B0282,,,,,,,,,,,,,0,,,,,J,jardins,,,1081,-0.749301,48.156447
2021-890886,2021-09-13,000001,Vente,295500,,,L AME,B009,53240,53229,Saint-Jean-sur-Mayenne,53,,,532290000B0283,,,,,,,,,,,,,0,,,,,VE,vergers,POMME,Pommiers,1100,-0.74925,48.156284
2021-890886,2021-09-13,000001,Vente,295500,3040,,RTE DE MONTFLOURS,0100,53240,53229,Saint-Jean-sur-Mayenne,53,,,532290000B0537,,,,,,,,,,,,,0,1,Maison,300,10,S,sols,,,382,-0.749467,48.156485
2021-890886,2021-09-13,000001,Vente,295500,,,LE JARDIN,B429,53240,53229,Saint-Jean-sur-Mayenne,53,,,532290000B0864,,,,,,,,,,,,,0,,,,,J,jardins,,,1713,-0.749488,48.156785
2021-891298,2021-09-17,000001,Vente,8000,18,,RUE DU MOULIN DE BOISSEAU,0102,53240,53229,Saint-Jean-sur-Mayenne,53,,,53229000AC0040,,,,,,,,,,,,,0,,,,,AG,terrains d'agrément,PARC,Parc,687,-0.752104,48.126947
2021-891357,2021-10-06,000001,Vente,44030,3,,IMP DES AMANDIERS,0007,53240,53229,Saint-Jean-sur-Mayenne,53,,,532290000A1990,,,,,,,,,,,,,0,,,,,AB,terrains a bâtir,,,518,-0.761804,48.135491
2021-891359,2021-10-05,000001,Vente,52830,23,,RUE DES CHARMES,0021,53240,53229,Saint-Jean-sur-Mayenne,53,,,532290000A2005,,,,,,,,,,,,,0,,,,,AB,terrains a bâtir,,,587,-0.763931,48.135483
2021-891492,2021-10-07,000001,Vente,52920,18,,RUE DES CHARMES,0021,53240,53229,Saint-Jean-sur-Mayenne,53,,,532290000A1980,,,,,,,,,,,,,0,,,,,AB,terrains a bâtir,,,588,-0.762812,48.136174
2021-891666,2021-10-02,000001,Vente,335000,4,,RUE DE L'AUBEPINE,0831,53240,53229,Saint-Jean-sur-Mayenne,53,,,53229000AA0242,,,,,,,,,,,,,0,1,Maison,176,5,S,sols,,,676,-0.760724,48.136116
2021-891741,2021-10-15,000001,Vente,393800,94,,CHE DU FRANCHET,0165,53240,53229,Saint-Jean-sur-Mayenne,53,,,532290000B0881,,,,,,,,,,,,,0,3,Dépendance,,0,S,sols,,,1224,-0.732472,48.13999
2021-891741,2021-10-15,000001,Vente,393800,94,,CHE DU FRANCHET,0165,53240,53229,Saint-Jean-sur-Mayenne,53,,,532290000B0881,,,,,,,,,,,,,0,1,Maison,204,5,S,sols,,,1224,-0.732472,48.13999
2021-891741,2021-10-15,000001,Vente,393800,,,LE JARDIN DU FRANCHET,B448,53240,53229,Saint-Jean-sur-Mayenne,53,,,532290000B0884,,,,,,,,,,,,,0,,,,,J,jardins,,,266,-0.732532,48.139773
2021-891741,2021-10-15,000001,Vente,393800,,,LE PRE DU HAUT,B700,53240,53229,Saint-Jean-sur-Mayenne,53,,,532290000B0887,,,,,,,,,,,,,0,,,,,P,prés,,,2510,-0.733065,48.139875
2021-892110,2021-10-25,000001,Vente,143000,28,,RUE DES CLOSEAUX,0023,53240,53229,Saint-Jean-sur-Mayenne,53,,,53229000AA0207,,,,,,,,,,,,,0,1,Maison,89,5,S,sols,,,640,-0.758201,48.134823
2021-892146,2021-10-19,000001,Vente,100000,11,,RUE DES PEUPLIERS,0110,53240,53229,Saint-Jean-sur-Mayenne,53,,,53229000AC0153,,,,,,,,,,,,,0,1,Maison,98,6,S,sols,,,529,-0.758284,48.128563
2021-892146,2021-10-19,000001,Vente,100000,11,,RUE DES PEUPLIERS,0110,53240,53229,Saint-Jean-sur-Mayenne,53,,,53229000AC0153,,,,,,,,,,,,,0,3,Dépendance,,0,S,sols,,,529,-0.758284,48.128563
2021-892155,2021-10-25,000001,Vente,58140,8,,RUE DES CHARMES,0021,53240,53229,Saint-Jean-sur-Mayenne,53,,,532290000A1975,,,,,,,,,,,,,0,,,,,AB,terrains a bâtir,,,646,-0.761502,48.136038
2021-892158,2021-10-26,000001,Vente,29000,,,LE TAILLIS DES CHAUSSEES,B772,53240,53229,Saint-Jean-sur-Mayenne,53,,,532290000A0436,,,,,,,,,,,,,0,,,,,BT,taillis simples,,,4449,-0.751766,48.142582
2021-892158,2021-10-26,000001,Vente,29000,,,LA BUTTE,B084,53240,53229,Saint-Jean-sur-Mayenne,53,,,532290000A0437,,,,,,,,,,,,,0,,,,,P,prés,,,2898,-0.75202,48.141967
2021-892158,2021-10-26,000001,Vente,29000,,,LES CHAUSSEES,B189,53240,53229,Saint-Jean-sur-Mayenne,53,,,532290000A0438,,,,,,,,,,,,,0,,,,,P,prés,,,13890,-0.750886,48.14096
2021-892158,2021-10-26,000001,Vente,29000,,,LE CHAMP D AVOINE,B099,53240,53229,Saint-Jean-sur-Mayenne,53,,,532290000A0439,,,,,,,,,,,,,0,,,,,T,terres,,,8139,-0.751401,48.141016
2021-892158,2021-10-26,000001,Vente,29000,,,LES PETITS CHAMPS,B611,53240,53229,Saint-Jean-sur-Mayenne,53,,,532290000A0440,,,,,,,,,,,,,0,,,,,T,terres,,,10172,-0.752257,48.141127
2021-892158,2021-10-26,000001,Vente,29000,,,LE BOIS DE LA BOUBARDIERE,B041,53240,53229,Saint-Jean-sur-Mayenne,53,,,532290000A0444,,,,,,,,,,,,,0,,,,,BT,taillis simples,,,2674,-0.752167,48.140626
2021-892158,2021-10-26,000001,Vente,29000,,,LE BOIS DE LA BOUBARDIERE,B041,53240,53229,Saint-Jean-sur-Mayenne,53,,,532290000A0445,,,,,,,,,,,,,0,,,,,BT,taillis simples,,,9057,-0.752453,48.140053
2021-892158,2021-10-26,000001,Vente,29000,,,L ECUSSEAU,B301,53240,53229,Saint-Jean-sur-Mayenne,53,,,532290000A0448,,,,,,,,,,,,,0,,,,,P,prés,,,6129,-0.752303,48.139509
2021-892212,2021-10-14,000001,Vente,215000,5,,IMP DES MOINEAUX,0101,53240,53229,Saint-Jean-sur-Mayenne,53,,,53229000AA0027,,,,,,,,,,,,,0,1,Maison,107,5,S,sols,,,726,-0.758806,48.136745
2021-892431,2021-10-27,000001,Vente,499000,3,,RUE DU PORT,0186,53240,53229,Saint-Jean-sur-Mayenne,53,,,53229000AB0069,,,,,,,,,,,,,0,1,Maison,236,9,S,sols,,,1040,-0.750219,48.133485
2021-892431,2021-10-27,000001,Vente,499000,3,,RUE DU PORT,0186,53240,53229,Saint-Jean-sur-Mayenne,53,,,53229000AB0069,,,,,,,,,,,,,0,1,Maison,236,9,AG,terrains d'agrément,PARC,Parc,3582,-0.750219,48.133485
2021-892507,2021-11-02,000001,Vente,280000,6,,IMP DES GENETS,0830,53240,53229,Saint-Jean-sur-Mayenne,53,,,53229000AA0234,,,,,,,,,,,,,0,1,Maison,145,5,S,sols,,,708,-0.76086,48.136693
2021-892507,2021-11-02,000001,Vente,280000,6,,IMP DES GENETS,0830,53240,53229,Saint-Jean-sur-Mayenne,53,,,53229000AA0234,,,,,,,,,,,,,0,3,Dépendance,,0,S,sols,,,708,-0.76086,48.136693
2021-892577,2021-11-02,000001,Vente,83000,5000,F,QUIFEUX,B741,53240,53229,Saint-Jean-sur-Mayenne,53,,,532290000C0387,,,,,,,,,,,,,0,3,Dépendance,,0,S,sols,,,36,-0.778923,48.135453
2021-892577,2021-11-02,000001,Vente,83000,884,,CHE DE QUIFEU,0150,53240,53229,Saint-Jean-sur-Mayenne,53,,,532290000C1111,,,,,,,,,,,,,0,3,Dépendance,,0,S,sols,,,419,-0.778875,48.135708
2021-892577,2021-11-02,000001,Vente,83000,884,,CHE DE QUIFEU,0150,53240,53229,Saint-Jean-sur-Mayenne,53,,,532290000C1111,,,,,,,,,,,,,0,1,Maison,67,4,S,sols,,,419,-0.778875,48.135708