id_mutation,date_mutation,numero_disposition,nature_mutation,valeur_fonciere,adresse_numero,adresse_suffixe,adresse_nom_voie,adresse_code_voie,code_postal,code_commune,nom_commune,code_departement,ancien_code_commune,ancien_nom_commune,id_parcelle,ancien_id_parcelle,numero_volume,lot1_numero,lot1_surface_carrez,lot2_numero,lot2_surface_carrez,lot3_numero,lot3_surface_carrez,lot4_numero,lot4_surface_carrez,lot5_numero,lot5_surface_carrez,nombre_lots,code_type_local,type_local,surface_reelle_bati,nombre_pieces_principales,code_nature_culture,nature_culture,code_nature_culture_speciale,nature_culture_speciale,surface_terrain,longitude,latitude
2021-884802,2021-01-04,000001,Vente,135000,16,,RUE DE MONTALON,0039,53300,53237,Saint-Mars-sur-Colmont,53,,,53237000AB0184,,,,,,,,,,,,,0,1,Maison,88,5,S,sols,,,1081,-0.700799,48.376339
2021-886013,2021-02-25,000001,Vente,1,,,LA LANFRAYERE,B418,53300,53237,Saint-Mars-sur-Colmont,53,,,53237000ZA0007,,,,,,,,,,,,,0,,,,,J,jardins,,,620,-0.726965,48.406256
2021-886435,2021-03-29,000001,Vente,13000,4,,LA RABACHERIE,B782,53300,53237,Saint-Mars-sur-Colmont,53,,,53237000ZN0047,,,,,,,,,,,,,0,1,Maison,37,2,S,sols,,,540,-0.730203,48.372613
2021-886435,2021-03-29,000001,Vente,13000,,,LA LONGUERAIE,B427,53300,53237,Saint-Mars-sur-Colmont,53,,,53237000ZN0048,,,,,,,,,,,,,0,,,,,T,terres,,,828,-0.730697,48.372687
2021-886442,2021-03-30,000001,Vente,74000,,,LA MOTTE,B448,53300,53237,Saint-Mars-sur-Colmont,53,,,53237000ZP0087,,,,,,,,,,,,,0,,,,,S,sols,,,47,-0.721629,48.383731
2021-886442,2021-03-30,000001,Vente,74000,5339,,LA MOTTE,B448,53300,53237,Saint-Mars-sur-Colmont,53,,,53237000ZP0097,,,,,,,,,,,,,0,,,,,S,sols,,,721,-0.721128,48.383025
2021-886442,2021-03-30,000001,Vente,74000,,,LA MOTTE,B448,53300,53237,Saint-Mars-sur-Colmont,53,,,53237000ZP0098,,,,,,,,,,,,,0,,,,,S,sols,,,3,-0.721537,48.383664
2021-886442,2021-03-30,000001,Vente,74000,,,LA MOTTE,B448,53300,53237,Saint-Mars-sur-Colmont,53,,,53237000ZP0103,,,,,,,,,,,,,0,,,,,S,sols,,,25,-0.72144,48.383274
2021-886442,2021-03-30,000001,Vente,74000,,,LA MOTTE,B448,53300,53237,Saint-Mars-sur-Colmont,53,,,53237000ZP0104,,,,,,,,,,,,,0,,,,,S,sols,,,30,-0.721427,48.383187
2021-886442,2021-03-30,000001,Vente,74000,2,,LA MOTTE,B448,53300,53237,Saint-Mars-sur-Colmont,53,,,53237000ZP0105,,,,,,,,,,,,,0,1,Maison,60,3,S,sols,,,920,-0.721606,48.383517
2021-886442,2021-03-30,000001,Vente,74000,,,LA MOTTE,B448,53300,53237,Saint-Mars-sur-Colmont,53,,,53237000ZP0106,,,,,,,,,,,,,0,,,,,S,sols,,,65,-0.721537,48.383213
2021-888216,2021-05-26,000001,Vente,170000,,,LE BOURG,B046,53300,53237,Saint-Mars-sur-Colmont,53,,,53237000AB0117,,,,,,,,,,,,,0,,,,,P,prés,,,115,-0.69605,48.373599
2021-888216,2021-05-26,000001,Vente,170000,24,,RUE D'OISSEAU,0042,53300,53237,Saint-Mars-sur-Colmont,53,,,53237000AB0118,,,,,,,,,,,,,0,,,,,J,jardins,,,701,-0.696113,48.37369
2021-888216,2021-05-26,000001,Vente,170000,16,,RUE D'OISSEAU,0042,53300,53237,Saint-Mars-sur-Colmont,53,,,53237000AB0125,,,,,,,,,,,,,0,,,,,S,sols,,,39,-0.696364,48.373856
2021-888216,2021-05-26,000001,Vente,170000,16,,RUE D'OISSEAU,0042,53300,53237,Saint-Mars-sur-Colmont,53,,,53237000AB0126,,,,,,,,,,,,,0,1,Maison,123,5,S,sols,,,154,-0.696495,48.373894
2021-888216,2021-05-26,000001,Vente,170000,16,,RUE D'OISSEAU,0042,53300,53237,Saint-Mars-sur-Colmont,53,,,53237000AB0126,,,,,,,,,,,,,0,3,Dépendance,,0,S,sols,,,154,-0.696495,48.373894
2021-888216,2021-05-26,000001,Vente,170000,,,LE BOURG,B046,53300,53237,Saint-Mars-sur-Colmont,53,,,53237000AB0127,,,,,,,,,,,,,0,,,,,S,sols,,,90,-0.696614,48.373892
2021-888216,2021-05-26,000001,Vente,170000,5016,B,RUE D'OISSEAU,0042,53300,53237,Saint-Mars-sur-Colmont,53,,,53237000AB0128,,,,,,,,,,,,,0,3,Dépendance,,0,S,sols,,,90,-0.696723,48.373901
2021-888216,2021-05-26,000001,Vente,170000,,,LE BOURG,B046,53300,53237,Saint-Mars-sur-Colmont,53,,,53237000AB0129,,,,,,,,,,,,,0,,,,,J,jardins,,,1730,-0.696729,48.373753
2021-888216,2021-05-26,000001,Vente,170000,5016,A,RUE D'OISSEAU,0042,53300,53237,Saint-Mars-sur-Colmont,53,,,53237000AB0130,,,,,,,,,,,,,0,3,Dépendance,,0,S,sols,,,51,-0.696841,48.373825
2021-888216,2021-05-26,000001,Vente,170000,,,LE BOURG,B046,53300,53237,Saint-Mars-sur-Colmont,53,,,53237000AB0132,,,,,,,,,,,,,0,,,,,P,prés,,,42,-0.697333,48.373801
2021-888216,2021-05-26,000001,Vente,170000,,,LE BOURG,B046,53300,53237,Saint-Mars-sur-Colmont,53,,,53237000ZK0015,,,,,,,,,,,,,0,,,,,P,prés,,,1900,-0.696725,48.373411
2021-891112,2021-08-30,000001,Vente,85000,,,LE BOURG,B046,53300,53237,Saint-Mars-sur-Colmont,53,,,53237000AB0148,,,,,,,,,,,,,0,,,,,J,jardins,,,309,-0.698697,48.374948
2021-891112,2021-08-30,000001,Vente,85000,2,,RUE DE CHATILLON,0008,53300,53237,Saint-Mars-sur-Colmont,53,,,53237000AB0149,,,,,,,,,,,,,0,1,Maison,109,4,S,sols,,,210,-0.698444,48.37496
2021-891349,2021-09-14,000001,Vente,118225,8,,RUE BELLEVUE,0005,53300,53237,Saint-Mars-sur-Colmont,53,,,53237000ZI0129,,,,,,,,,,,,,0,1,Maison,90,5,S,sols,,,499,-0.695009,48.374265
2021-892987,2021-12-09,000002,Vente,1270,1,,LE BOUILLON,B041,53300,53237,Saint-Mars-sur-Colmont,53,,,53237000ZA0075,,,,,,,,,,,,,0,1,Maison,76,4,S,sols,,,2089,-0.724453,48.408279
2021-892987,2021-12-09,000002,Vente,1270,1,,LE BOUILLON,B041,53300,53237,Saint-Mars-sur-Colmont,53,,,53237000ZA0075,,,,,,,,,,,,,0,3,Dépendance,,0,S,sols,,,2089,-0.724453,48.408279
2021-892987,2021-12-09,000002,Vente,1270,,,LE BOUILLON,B041,53300,53237,Saint-Mars-sur-Colmont,53,,,53237000ZA0076,,,,,,,,,,,,,0,,,,,P,prés,,,315,-0.72418,48.408138
2021-892987,2021-12-09,000002,Vente,1270,,,LE BOUILLON,B041,53300,53237,Saint-Mars-sur-Colmont,53,,,53237000ZA0077,,,,,,,,,,,,,0,,,,,S,sols,,,195,-0.724525,48.40813
2021-892987,2021-12-09,000002,Vente,1270,,,LE BOUILLON,B041,53300,53237,Saint-Mars-sur-Colmont,53,,,53237000ZA0079,,,,,,,,,,,,,0,,,,,J,jardins,,,383,-0.724803,48.408123
2021-892988,2021-12-09,000004,Vente,20000,1,,LE BOUILLON,B041,53300,53237,Saint-Mars-sur-Colmont,53,,,53237000ZA0075,,,,,,,,,,,,,0,1,Maison,76,4,S,sols,,,2089,-0.724453,48.408279
2021-892988,2021-12-09,000004,Vente,20000,1,,LE BOUILLON,B041,53300,53237,Saint-Mars-sur-Colmont,53,,,53237000ZA0075,,,,,,,,,,,,,0,3,Dépendance,,0,S,sols,,,2089,-0.724453,48.408279
2021-892988,2021-12-09,000004,Vente,20000,,,LE BOUILLON,B041,53300,53237,Saint-Mars-sur-Colmont,53,,,53237000ZA0076,,,,,,,,,,,,,0,,,,,P,prés,,,315,-0.72418,48.408138
2021-892988,2021-12-09,000004,Vente,20000,,,LE BOUILLON,B041,53300,53237,Saint-Mars-sur-Colmont,53,,,53237000ZA0077,,,,,,,,,,,,,0,,,,,S,sols,,,195,-0.724525,48.40813
2021-892988,2021-12-09,000004,Vente,20000,,,LE BOUILLON,B041,53300,53237,Saint-Mars-sur-Colmont,53,,,53237000ZA0079,,,,,,,,,,,,,0,,,,,J,jardins,,,383,-0.724803,48.408123
2021-894098,2021-12-29,000001,Echange,5400,,,LA POULEGRENIERE,B547,53300,53237,Saint-Mars-sur-Colmont,53,,,53237000ZI0144,,,,,,,,,,,,,0,,,,,T,terres,,,4900,-0.687876,48.371001
2021-894098,2021-12-29,000001,Echange,5400,,,LA POULEGRENIERE,B547,53300,53237,Saint-Mars-sur-Colmont,53,,,53237000ZI0144,,,,,,,,,,,,,0,,,,,P,prés,,,2087,-0.687876,48.371001
2021-894098,2021-12-29,000002,Echange,5400,,,LA POULEGRENIERE,B547,53300,53237,Saint-Mars-sur-Colmont,53,,,53237000ZI0049,,,,,,,,,,,,,0,,,,,P,prés,,,720,-0.692986,48.371355
2021-894098,2021-12-29,000002,Echange,5400,,,LES SORBIERS,B798,53300,53237,Saint-Mars-sur-Colmont,53,,,53237000ZI0221,,,,,,,,,,,,,0,,,,,P,prés,,,7686,-0.691455,48.371395
2021-894098,2021-12-29,000002,Echange,5400,,,LES SORBIERS,B798,53300,53237,Saint-Mars-sur-Colmont,53,,,53237000ZI0221,,,,,,,,,,,,,0,,,,,P,prés,,,1600,-0.691455,48.371395
2021-894098,2021-12-29,000002,Echange,5400,,,LA POULEGRENIERE,B547,53300,53237,Saint-Mars-sur-Colmont,53,,,53237000ZI0223,,,,,,,,,,,,,0,,,,,T,terres,,,572,,
