id_mutation,date_mutation,numero_disposition,nature_mutation,valeur_fonciere,adresse_numero,adresse_suffixe,adresse_nom_voie,adresse_code_voie,code_postal,code_commune,nom_commune,code_departement,ancien_code_commune,ancien_nom_commune,id_parcelle,ancien_id_parcelle,numero_volume,lot1_numero,lot1_surface_carrez,lot2_numero,lot2_surface_carrez,lot3_numero,lot3_surface_carrez,lot4_numero,lot4_surface_carrez,lot5_numero,lot5_surface_carrez,nombre_lots,code_type_local,type_local,surface_reelle_bati,nombre_pieces_principales,code_nature_culture,nature_culture,code_nature_culture_speciale,nature_culture_speciale,surface_terrain,longitude,latitude
2021-884753,2021-01-09,000001,Vente,29500,14,,RUE DE LA LIBERATION,0074,53500,53245,Saint-Pierre-des-Landes,53,,,53245000AZ0038,,,,,,,,,,,,,0,1,Maison,57,2,S,sols,,,177,-1.028561,48.274445
2021-884861,2021-01-19,000002,Vente,18000,,,EPIE,B071,53500,53245,Saint-Pierre-des-Landes,53,,,53245000AO0217,,,,,,,,,,,,,0,,,,,T,terres,,,11107,-0.975499,48.292037
2021-884861,2021-01-19,000002,Vente,18000,,,EPIE,B071,53500,53245,Saint-Pierre-des-Landes,53,,,53245000AO0219,,,,,,,,,,,,,0,,,,,T,terres,,,12,-0.975002,48.291342
2021-884861,2021-01-19,000002,Vente,18000,,,EPIE,B071,53500,53245,Saint-Pierre-des-Landes,53,,,53245000AO0221,,,,,,,,,,,,,0,,,,,S,sols,,,49,-0.974901,48.290841
2021-884940,2021-01-22,000002,Vente,743,,,LAUNAY,B127,53500,53245,Saint-Pierre-des-Landes,53,,,53245000BD0169,,,,,,,,,,,,,0,,,,,T,terres,,,191,-1.028872,48.277663
2021-884941,2021-01-21,000001,Vente,17500,5410,,MILIEU BOUE,B138,53500,53245,Saint-Pierre-des-Landes,53,,,53245000AS0115,,,,,,,,,,,,,0,1,Maison,80,5,S,sols,,,1914,-1.011172,48.301506
2021-884965,2021-01-29,000001,Vente,55660,185,,BAS-FOUSSEAU,B018,53500,53245,Saint-Pierre-des-Landes,53,,,53245000BI0007,,,,,,,,,,,,,0,1,Maison,68,2,S,sols,,,3010,-1.07887,48.280783
2021-884965,2021-01-29,000001,Vente,55660,,,BAS-FOUSSEAU,B018,53500,53245,Saint-Pierre-des-Landes,53,,,53245000BI0120,,,,,,,,,,,,,0,,,,,VE,vergers,,,2907,-1.079232,48.280697
2021-884965,2021-01-29,000001,Vente,55660,,,BAS-FOUSSEAU,B018,53500,53245,Saint-Pierre-des-Landes,53,,,53245000BI0120,,,,,,,,,,,,,0,,,,,S,sols,,,120,-1.079232,48.280697
2021-885093,2021-01-18,000001,Vente,58750,,,RUE DE LA LIBERATION,0074,53500,53245,Saint-Pierre-des-Landes,53,,,53245000AZ0230,,,,,,,,,,,,,0,,,,,J,jardins,,,936,-1.032104,48.275787
2021-885093,2021-01-18,000001,Vente,58750,41,,RUE DE LA LIBERATION,0074,53500,53245,Saint-Pierre-des-Landes,53,,,53245000AZ0231,,,,,,,,,,,,,0,1,Maison,72,4,S,sols,,,224,-1.031856,48.276101
2021-885689,2021-02-26,000001,Vente,40000,60,,RUE DE LA LIBERATION,0074,53500,53245,Saint-Pierre-des-Landes,53,,,53245000AZ0239,,,,,,,,,,,,,0,1,Maison,73,5,S,sols,,,398,-1.032713,48.276735
2021-885800,2021-03-02,000002,Vente,44838.6,,,COUHABRUN,B065,53500,53245,Saint-Pierre-des-Landes,53,,,53245000BD0009,,,,,,,,,,,,,0,,,,,T,terres,,,2970,-1.037926,48.280391
2021-885800,2021-03-02,000002,Vente,44838.6,,,COUHABRUN,B065,53500,53245,Saint-Pierre-des-Landes,53,,,53245000BD0010,,,,,,,,,,,,,0,,,,,T,terres,,,14090,-1.036476,48.281531
2021-885800,2021-03-02,000002,Vente,44838.6,,,COUHABRUN,B065,53500,53245,Saint-Pierre-des-Landes,53,,,53245000BD0010,,,,,,,,,,,,,0,,,,,T,terres,,,14090,-1.036476,48.281531
2021-885800,2021-03-02,000002,Vente,44838.6,,,COUHABRUN,B065,53500,53245,Saint-Pierre-des-Landes,53,,,53245000BD0120,,,,,,,,,,,,,0,,,,,VE,vergers,,,6368,-1.035964,48.282622
2021-885800,2021-03-02,000002,Vente,44838.6,,,COUHABRUN,B065,53500,53245,Saint-Pierre-des-Landes,53,,,53245000BD0243,,,,,,,,,,,,,0,,,,,P,prés,,,29768,-1.034755,48.281486
2021-885800,2021-03-02,000002,Vente,44838.6,,,COUHABRUN,B065,53500,53245,Saint-Pierre-des-Landes,53,,,53245000BD0244,,,,,,,,,,,,,0,,,,,P,prés,,,72,-1.035171,48.282783
2021-885800,2021-03-02,000002,Vente,44838.6,,,COUHABRUN,B065,53500,53245,Saint-Pierre-des-Landes,53,,,53245000BD0245,,,,,,,,,,,,,0,,,,,P,prés,,,7291,-1.03499,48.283281
2021-885800,2021-03-02,000002,Vente,44838.6,,,COUHABRUN,B065,53500,53245,Saint-Pierre-des-Landes,53,,,53245000BD0246,,,,,,,,,,,,,0,,,,,P,prés,,,82,-1.035224,48.282982
2021-885981,2021-03-09,000001,Vente,22000,,,RUE DU CENTRE,0018,53500,53245,Saint-Pierre-des-Landes,53,,,53245000AZ0075,,,,,,,,,,,,,0,,,,,J,jardins,,,38,-1.027314,48.274388
2021-885981,2021-03-09,000001,Vente,22000,,,RUE DU CENTRE,0018,53500,53245,Saint-Pierre-des-Landes,53,,,53245000AZ0076,,,,,,,,,,,,,0,,,,,J,jardins,,,44,-1.027275,48.27443
2021-885981,2021-03-09,000001,Vente,22000,13,,RUE DU CENTRE,0018,53500,53245,Saint-Pierre-des-Landes,53,,,53245000AZ0078,,,,,,,,,,,,,0,1,Maison,70,2,S,sols,,,64,-1.027368,48.274226
2021-885981,2021-03-09,000001,Vente,22000,5011,,RUE DU CENTRE,0018,53500,53245,Saint-Pierre-des-Landes,53,,,53245000AZ0088,,,,,,,,,,,,,0,3,Dépendance,,0,S,sols,,,51,-1.027384,48.27417
2021-885981,2021-03-09,000001,Vente,22000,,,RUE DU CENTRE,0018,53500,53245,Saint-Pierre-des-Landes,53,,,53245000AZ0243,,,,,,,,,,,,,0,,,,,S,sols,,,43,-1.027267,48.274355
2021-885993,2021-03-12,000001,Vente,86000,,,LE BAS FOUGEROLLES,B009,53500,53245,Saint-Pierre-des-Landes,53,,,53245000AE0069,,,,,,,,,,,,,0,,,,,P,prés,,,53180,-1.029249,48.28934
2021-885993,2021-03-12,000001,Vente,86000,,,LES MORINAIS,B144,53500,53245,Saint-Pierre-des-Landes,53,,,53245000AE0096,,,,,,,,,,,,,0,,,,,P,prés,,,4660,-1.03128,48.28869
2021-885993,2021-03-12,000001,Vente,86000,,,LE CHENE BRULE,B060,53500,53245,Saint-Pierre-des-Landes,53,,,53245000AX0010,,,,,,,,,,,,,0,,,,,P,prés,,,9050,-1.022503,48.253138
2021-885993,2021-03-12,000001,Vente,86000,,,LES EPINERIERS,B072,53500,53245,Saint-Pierre-des-Landes,53,,,53245000AX0020,,,,,,,,,,,,,0,,,,,T,terres,,,8670,-1.019626,48.257332
2021-885993,2021-03-12,000001,Vente,86000,,,LES EPINERIERS,B072,53500,53245,Saint-Pierre-des-Landes,53,,,53245000AX0022,,,,,,,,,,,,,0,,,,,T,terres,,,3810,-1.017654,48.258101
2021-885993,2021-03-12,000001,Vente,86000,,,CLOS BARIL,B064,53500,53245,Saint-Pierre-des-Landes,53,,,53245000AX0110,,,,,,,,,,,,,0,,,,,P,prés,,,10000,-1.019992,48.254581
2021-885993,2021-03-12,000001,Vente,86000,,,CLOS BARIL,B064,53500,53245,Saint-Pierre-des-Landes,53,,,53245000AX0110,,,,,,,,,,,,,0,,,,,T,terres,,,30135,-1.019992,48.254581
2021-885993,2021-03-12,000001,Vente,86000,,,CLOS BARIL,B064,53500,53245,Saint-Pierre-des-Landes,53,,,53245000AX0110,,,,,,,,,,,,,0,,,,,T,terres,,,40135,-1.019992,48.254581
2021-885993,2021-03-12,000001,Vente,86000,,,LE PETIT COUHOUROUX,B157,53500,53245,Saint-Pierre-des-Landes,53,,,53245000AY0067,,,,,,,,,,,,,0,,,,,P,prés,,,7120,-1.024805,48.2638
2021-885993,2021-03-12,000001,Vente,86000,,,LE PETIT COUHOUROUX,B157,53500,53245,Saint-Pierre-des-Landes,53,,,53245000AY0068,,,,,,,,,,,,,0,,,,,T,terres,,,7290,-1.023519,48.262575
2021-885993,2021-03-12,000001,Vente,86000,,,LA FOLIE,B073,53500,53245,Saint-Pierre-des-Landes,53,,,53245000AY0077,,,,,,,,,,,,,0,,,,,T,terres,,,11070,-1.022258,48.259741
2021-885993,2021-03-12,000001,Vente,86000,,,LA FOLIE,B073,53500,53245,Saint-Pierre-des-Landes,53,,,53245000AY0080,,,,,,,,,,,,,0,,,,,T,terres,,,7540,-1.025173,48.26026
2021-885993,2021-03-12,000001,Vente,86000,,,LA JAUNAIS,B118,53500,53245,Saint-Pierre-des-Landes,53,,,53245000AY0219,,,,,,,,,,,,,0,,,,,T,terres,,,10435,-1.031136,48.257559
2021-885993,2021-03-12,000001,Vente,86000,,,LA FOLIE,B073,53500,53245,Saint-Pierre-des-Landes,53,,,53245000AY0223,,,,,,,,,,,,,0,,,,,S,sols,,,1457,-1.023023,48.260521
2021-886044,2021-03-15,000001,Vente,30411.5,,,LE PETIT PONT,B159,53500,53245,Saint-Pierre-des-Landes,53,,,53245000AN0103,,,,,,,,,,,,,0,,,,,P,prés,,,7130,-0.993691,48.302648
2021-886044,2021-03-15,000001,Vente,30411.5,,,LE PETIT PONT,B159,53500,53245,Saint-Pierre-des-Landes,53,,,53245000AN0105,,,,,,,,,,,,,0,,,,,T,terres,,,16810,-0.994005,48.301895
2021-886044,2021-03-15,000001,Vente,30411.5,,,LE GRAND PONT,B086,53500,53245,Saint-Pierre-des-Landes,53,,,53245000AN0234,,,,,,,,,,,,,0,,,,,T,terres,,,7665,-0.992381,48.301757
2021-886044,2021-03-15,000001,Vente,30411.5,,,LE GRAND PONT,B086,53500,53245,Saint-Pierre-des-Landes,53,,,53245000AN0236,,,,,,,,,,,,,0,,,,,T,terres,,,11840,-0.992805,48.303114
2021-886158,2021-03-11,000001,Vente,19380,9,,RUE DES GAUDECHES,0070,53500,53245,Saint-Pierre-des-Landes,53,,,53245000AZ0457,,,,,,,,,,,,,0,,,,,AB,terrains a bâtir,,,969,-1.024809,48.273501
2021-886163,2021-03-15,000001,Vente,25588.5,,,LE GRAND PONT,B086,53500,53245,Saint-Pierre-des-Landes,53,,,53245000AN0238,,,,,,,,,,,,,0,,,,,P,prés,,,9829,-0.993019,48.300986
2021-886163,2021-03-15,000001,Vente,25588.5,,,LE GRAND PONT,B086,53500,53245,Saint-Pierre-des-Landes,53,,,53245000AN0238,,,,,,,,,,,,,0,,,,,T,terres,,,26726,-0.993019,48.300986
2021-886636,2021-04-12,000001,Vente,85000,,,ROUGEUL,B185,53500,53245,Saint-Pierre-des-Landes,53,,,53245000BK0053,,,,,,,,,,,,,0,,,,,P,prés,,,6420,-1.088391,48.282996
2021-886636,2021-04-12,000001,Vente,85000,,,ROUGEUL,B185,53500,53245,Saint-Pierre-des-Landes,53,,,53245000BK0053,,,,,,,,,,,,,0,,,,,P,prés,,,6000,-1.088391,48.282996
2021-886636,2021-04-12,000001,Vente,85000,4094,,RTE DE LUITRE,0195,53500,53245,Saint-Pierre-des-Landes,53,,,53245000BK0055,,,,,,,,,,,,,0,3,Dépendance,,0,S,sols,,,400,-1.087214,48.282603
2021-886636,2021-04-12,000001,Vente,85000,4094,,RTE DE LUITRE,0195,53500,53245,Saint-Pierre-des-Landes,53,,,53245000BK0055,,,,,,,,,,,,,0,1,Maison,148,5,S,sols,,,400,-1.087214,48.282603
2021-886742,2021-04-15,000001,Vente,5000,1640,,RTE DE LA GARE,0178,53500,53245,Saint-Pierre-des-Landes,53,,,53245000AE0068,,,,,,,,,,,,,0,1,Maison,42,2,S,sols,,,430,-1.026795,48.290504
2021-886893,2021-04-23,000001,Vente,5190,,,LA VERDERIE,B196,53500,53245,Saint-Pierre-des-Landes,53,,,53245000BD0063,,,,,,,,,,,,,0,,,,,S,sols,,,20,-1.029885,48.281189
2021-886893,2021-04-23,000001,Vente,5190,,,LA VERDERIE,B196,53500,53245,Saint-Pierre-des-Landes,53,,,53245000BD0063,,,,,,,,,,,,,0,,,,,T,terres,,,9790,-1.029885,48.281189
2021-886893,2021-04-23,000001,Vente,5190,,,LA VERDERIE,B196,53500,53245,Saint-Pierre-des-Landes,53,,,53245000BD0214,,,,,,,,,,,,,0,,,,,P,prés,,,1912,-1.028758,48.281793
2021-886893,2021-04-23,000001,Vente,5190,,,LA VERDERIE,B196,53500,53245,Saint-Pierre-des-Landes,53,,,53245000BD0249,,,,,,,,,,,,,0,,,,,S,sols,,,6933,-1.029475,48.281724
2021-887114,2021-04-27,000001,Vente,15880,28,,RUE D ERNEE,0048,53500,53245,Saint-Pierre-des-Landes,53,,,53245000AZ0461,,,,,,,,,,,,,0,,,,,AB,terrains a bâtir,,,794,-1.024406,48.274245
2021-887273,2021-05-04,000001,Vente,109253.2,,,LA ROCHELLE,B179,53500,53245,Saint-Pierre-des-Landes,53,,,53245000AM0051,,,,,,,,,,,,,0,,,,,VE,vergers,,,1720,-0.997904,48.299525
2021-887273,2021-05-04,000001,Vente,109253.2,,,LA ROCHELLE,B179,53500,53245,Saint-Pierre-des-Landes,53,,,53245000AM0057,,,,,,,,,,,,,0,,,,,P,prés,,,10240,-1.000133,48.300193
2021-887273,2021-05-04,000001,Vente,109253.2,,,LA ROCHELLE,B179,53500,53245,Saint-Pierre-des-Landes,53,,,53245000AM0057,,,,,,,,,,,,,0,,,,,P,prés,,,20480,-1.000133,48.300193
2021-887273,2021-05-04,000001,Vente,109253.2,,,LA ROCHELLE,B179,53500,53245,Saint-Pierre-des-Landes,53,,,53245000AM0058,,,,,,,,,,,,,0,,,,,P,prés,,,13800,-1.000767,48.298747
2021-887273,2021-05-04,000001,Vente,109253.2,,,LA ROCHELLE,B179,53500,53245,Saint-Pierre-des-Landes,53,,,53245000AM0059,,,,,,,,,,,,,0,,,,,P,prés,CHEM,Chemin (non groupe),1977,-0.999786,48.298384
2021-887273,2021-05-04,000001,Vente,109253.2,,,LA ROCHELLE,B179,53500,53245,Saint-Pierre-des-Landes,53,,,53245000AM0060,,,,,,,,,,,,,0,,,,,P,prés,,,13220,-1.00129,48.298071
2021-887273,2021-05-04,000001,Vente,109253.2,,,LA ROCHELLE,B179,53500,53245,Saint-Pierre-des-Landes,53,,,53245000AM0163,,,,,,,,,,,,,0,,,,,P,prés,,,21819,-0.997511,48.29909
2021-887273,2021-05-04,000001,Vente,109253.2,,,LA OUVINAIS,B146,53500,53245,Saint-Pierre-des-Landes,53,,,53245000AN0082,,,,,,,,,,,,,0,,,,,P,prés,,,15690,-0.997292,48.295955
2021-887273,2021-05-04,000001,Vente,109253.2,,,LA HOUVINAIS,B116,53500,53245,Saint-Pierre-des-Landes,53,,,53245000AS0036,,,,,,,,,,,,,0,,,,,P,prés,,,2900,-0.999139,48.29841
2021-887273,2021-05-04,000001,Vente,109253.2,,,LA HOUVINAIS,B116,53500,53245,Saint-Pierre-des-Landes,53,,,53245000AS0098,,,,,,,,,,,,,0,,,,,T,terres,,,484,-0.998358,48.295748
2021-887273,2021-05-04,000001,Vente,109253.2,,,LA HOUVINAIS,B116,53500,53245,Saint-Pierre-des-Landes,53,,,53245000AS0099,,,,,,,,,,,,,0,,,,,T,terres,,,53746,-0.99925,48.296651
2021-887286,2021-05-04,000001,Vente,3108,,,LE GRAND PONT,B086,53500,53245,Saint-Pierre-des-Landes,53,,,53245000AN0089,,,,,,,,,,,,,0,,,,,P,prés,,,4440,-0.99347,48.299935
2021-887350,2021-04-28,000003,Vente,27500,,,LE BAS HAUT BOIS,B010,53500,53245,Saint-Pierre-des-Landes,53,,,53245000AS0155,,,,,,,,,,,,,0,,,,,S,sols,,,1276,-1.011614,48.291417
2021-887351,2021-04-28,000004,Vente,182387.8,,,LE BAS HAUT BOIS,B010,53500,53245,Saint-Pierre-des-Landes,53,,,53245000AS0060,,,,,,,,,,,,,0,,,,,BT,taillis simples,,,2410,-1.013327,48.292696
2021-887351,2021-04-28,000004,Vente,182387.8,,,LE BAS HAUT BOIS,B010,53500,53245,Saint-Pierre-des-Landes,53,,,53245000AS0062,,,,,,,,,,,,,0,,,,,P,prés,,,8500,-1.014455,48.291999
2021-887351,2021-04-28,000004,Vente,182387.8,,,LE BAS HAUT BOIS,B010,53500,53245,Saint-Pierre-des-Landes,53,,,53245000AS0062,,,,,,,,,,,,,0,,,,,P,prés,,,8500,-1.014455,48.291999
2021-887351,2021-04-28,000004,Vente,182387.8,,,LE BAS HAUT BOIS,B010,53500,53245,Saint-Pierre-des-Landes,53,,,53245000AS0067,,,,,,,,,,,,,0,,,,,VE,vergers,,,910,-1.014805,48.292952
2021-887351,2021-04-28,000004,Vente,182387.8,,,LE BAS HAUT BOIS,B010,53500,53245,Saint-Pierre-des-Landes,53,,,53245000AS0153,,,,,,,,,,,,,0,,,,,P,prés,,,42520,-1.012529,48.2922
2021-887351,2021-04-28,000004,Vente,182387.8,,,LE BAS HAUT BOIS,B010,53500,53245,Saint-Pierre-des-Landes,53,,,53245000AT0034,,,,,,,,,,,,,0,,,,,P,prés,,,38000,-1.01545,48.28981
2021-887351,2021-04-28,000004,Vente,182387.8,,,LE BAS HAUT BOIS,B010,53500,53245,Saint-Pierre-des-Landes,53,,,53245000AT0035,,,,,,,,,,,,,0,,,,,T,terres,,,23410,-1.010812,48.290299
2021-887351,2021-04-28,000004,Vente,182387.8,,,LE BAS HAUT BOIS,B010,53500,53245,Saint-Pierre-des-Landes,53,,,53245000AT0035,,,,,,,,,,,,,0,,,,,T,terres,,,23410,-1.010812,48.290299
2021-887351,2021-04-28,000004,Vente,182387.8,,,LE BAS HAUT BOIS,B010,53500,53245,Saint-Pierre-des-Landes,53,,,53245000AT0037,,,,,,,,,,,,,0,,,,,T,terres,,,10590,-1.007606,48.291286
2021-887351,2021-04-28,000004,Vente,182387.8,,,LE BAS HAUT BOIS,B010,53500,53245,Saint-Pierre-des-Landes,53,,,53245000AT0058,,,,,,,,,,,,,0,,,,,P,prés,,,25180,-1.01308,48.289979
2021-887351,2021-04-28,000004,Vente,182387.8,,,LE BAS HAUT BOIS,B010,53500,53245,Saint-Pierre-des-Landes,53,,,53245000AT0065,,,,,,,,,,,,,0,,,,,T,terres,,,112,-1.006509,48.291123
2021-887351,2021-04-28,000004,Vente,182387.8,,,LE BAS HAUT BOIS,B010,53500,53245,Saint-Pierre-des-Landes,53,,,53245000AT0066,,,,,,,,,,,,,0,,,,,T,terres,,,656,-1.008718,48.291129
2021-887351,2021-04-28,000004,Vente,182387.8,,,LE BAS HAUT BOIS,B010,53500,53245,Saint-Pierre-des-Landes,53,,,53245000AT0101,,,,,,,,,,,,,0,,,,,T,terres,,,12978,-1.011367,48.291255
2021-887589,2021-05-14,000001,Vente,17690,,,CHAMP ROSIER,B054,53500,53245,Saint-Pierre-des-Landes,53,,,53245000AC0124,,,,,,,,,,,,,0,,,,,T,terres,,,4450,-1.034076,48.30208
2021-887589,2021-05-14,000001,Vente,17690,,,CHAMP ROSIER,B054,53500,53245,Saint-Pierre-des-Landes,53,,,53245000AC0124,,,,,,,,,,,,,0,,,,,T,terres,,,2225,-1.034076,48.30208
2021-887589,2021-05-14,000001,Vente,17690,,,CHAMP ROSIER,B054,53500,53245,Saint-Pierre-des-Landes,53,,,53245000AC0126,,,,,,,,,,,,,0,,,,,T,terres,,,205,-1.031307,48.302403
2021-887589,2021-05-14,000001,Vente,17690,,,CHAMP ROSIER,B054,53500,53245,Saint-Pierre-des-Landes,53,,,53245000AC0128,,,,,,,,,,,,,0,,,,,T,terres,,,6137,-1.033172,48.302093
2021-887589,2021-05-14,000001,Vente,17690,,,CHAMP ROSIER,B054,53500,53245,Saint-Pierre-des-Landes,53,,,53245000AC0130,,,,,,,,,,,,,0,,,,,T,terres,,,8329,-1.032141,48.301976
2021-887589,2021-05-14,000001,Vente,17690,,,CHAMP ROSIER,B054,53500,53245,Saint-Pierre-des-Landes,53,,,53245000AH0172,,,,,,,,,,,,,0,,,,,P,prés,,,4558,,
2021-887589,2021-05-14,000001,Vente,17690,,,CHAMP ROSIER,B054,53500,53245,Saint-Pierre-des-Landes,53,,,53245000AH0173,,,,,,,,,,,,,0,,,,,S,sols,,,12,,
2021-887590,2021-05-14,000001,Vente,12310,,,CHAMP ROSIER,B054,53500,53245,Saint-Pierre-des-Landes,53,,,53245000AH0012,,,,,,,,,,,,,0,,,,,P,prés,,,10900,-1.028512,48.3018
2021-887590,2021-05-14,000001,Vente,12310,,,CHAMP ROSIER,B054,53500,53245,Saint-Pierre-des-Landes,53,,,53245000AH0027,,,,,,,,,,,,,0,,,,,P,prés,,,3220,-1.029208,48.302726
2021-887590,2021-05-14,000001,Vente,12310,,,CHAMP ROSIER,B054,53500,53245,Saint-Pierre-des-Landes,53,,,53245000AH0028,,,,,,,,,,,,,0,,,,,P,prés,,,3910,-1.028698,48.302366
2021-887879,2021-05-11,000001,Vente,170000,,,GRAND BOUE,B084,53500,53245,Saint-Pierre-des-Landes,53,,,53245000AS0126,,,,,,,,,,,,,0,,,,,T,terres,,,594,-1.013225,48.298643
2021-887879,2021-05-11,000001,Vente,170000,,,GRAND BOUE,B084,53500,53245,Saint-Pierre-des-Landes,53,,,53245000AS0128,,,,,,,,,,,,,0,,,,,T,terres,,,395,-1.013397,48.298661
2021-887879,2021-05-11,000001,Vente,170000,2882,,RTE DE MEGAUDAIS,0076,53500,53245,Saint-Pierre-des-Landes,53,,,53245000AS0164,,,,,,,,,,,,,0,1,Maison,85,5,J,jardins,,,812,-1.013193,48.298405
2021-887879,2021-05-11,000001,Vente,170000,2882,,RTE DE MEGAUDAIS,0076,53500,53245,Saint-Pierre-des-Landes,53,,,53245000AS0164,,,,,,,,,,,,,0,1,Maison,29,1,J,jardins,,,812,-1.013193,48.298405
2021-887879,2021-05-11,000001,Vente,170000,2882,,RTE DE MEGAUDAIS,0076,53500,53245,Saint-Pierre-des-Landes,53,,,53245000AS0164,,,,,,,,,,,,,0,1,Maison,85,5,S,sols,,,1318,-1.013193,48.298405
2021-887879,2021-05-11,000001,Vente,170000,2882,,RTE DE MEGAUDAIS,0076,53500,53245,Saint-Pierre-des-Landes,53,,,53245000AS0164,,,,,,,,,,,,,0,1,Maison,29,1,S,sols,,,1318,-1.013193,48.298405
2021-887934,2021-05-26,000001,Vente,26008.5,,,LE PETIT PONT,B159,53500,53245,Saint-Pierre-des-Landes,53,,,53245000AM0124,,,,,,,,,,,,,0,,,,,P,prés,,,140,-0.997404,48.301735
2021-887934,2021-05-26,000001,Vente,26008.5,,,LA ROCHELLE,B179,53500,53245,Saint-Pierre-des-Landes,53,,,53245000AM0165,,,,,,,,,,,,,0,,,,,P,prés,,,103,-0.997976,48.299889
2021-887934,2021-05-26,000001,Vente,26008.5,,,LA ROCHELLE,B179,53500,53245,Saint-Pierre-des-Landes,53,,,53245000AM0166,,,,,,,,,,,,,0,,,,,P,prés,,,32931,-0.998058,48.301022
2021-887934,2021-05-26,000001,Vente,26008.5,,,LA ROCHELLE,B179,53500,53245,Saint-Pierre-des-Landes,53,,,53245000AM0168,,,,,,,,,,,,,0,,,,,VE,vergers,,,2277,-0.998226,48.299953
2021-887934,2021-05-26,000001,Vente,26008.5,,,LA ROCHELLE,B179,53500,53245,Saint-Pierre-des-Landes,53,,,53245000AM0170,,,,,,,,,,,,,0,,,,,S,sols,,,1704,-0.997805,48.299699
2021-887968,2021-05-29,000001,Vente,19180,3,,RUE DES JONQUILLES,0073,53500,53245,Saint-Pierre-des-Landes,53,,,53245000AZ0459,,,,,,,,,,,,,0,,,,,AB,terrains a bâtir,,,959,-1.024754,48.273787
2021-887969,2021-05-21,000001,Vente,113000,,,BEAUMESNIL,B027,53500,53245,Saint-Pierre-des-Landes,53,,,53245000BD0227,,,,,,,,,,,,,0,,,,,P,prés,,,584,-1.045901,48.282752
2021-887969,2021-05-21,000001,Vente,113000,49,,CHE DU BEAUMESNIL,0147,53500,53245,Saint-Pierre-des-Landes,53,,,53245000BD0229,,,,,,,,,,,,,0,1,Maison,66,4,S,sols,,,2345,-1.04622,48.282723
2021-887969,2021-05-21,000001,Vente,113000,,,BEAUMESNIL,B027,53500,53245,Saint-Pierre-des-Landes,53,,,53245000BD0231,,,,,,,,,,,,,0,,,,,T,terres,,,470,-1.046454,48.28287
2021-888068,2021-06-05,000001,Vente,60000,20,,RUE DU PLAN D EAU,0080,53500,53245,Saint-Pierre-des-Landes,53,,,53245000AZ0193,,,,,,,,,,,,,0,1,Maison,42,2,S,sols,,,614,-1.029918,48.272648
2021-888069,2021-05-11,000001,Vente,198474.5,,,LE PETIT PONT,B159,53500,53245,Saint-Pierre-des-Landes,53,,,53245000AM0049,,,,,,,,,,,,,0,,,,,P,prés,,,7960,-0.995292,48.300241
2021-888069,2021-05-11,000001,Vente,198474.5,,,LE PETIT PONT,B159,53500,53245,Saint-Pierre-des-Landes,53,,,53245000AM0140,,,,,,,,,,,,,0,,,,,P,prés,,,10263,-0.996217,48.301038
2021-888069,2021-05-11,000001,Vente,198474.5,,,LA ROCHELLE,B179,53500,53245,Saint-Pierre-des-Landes,53,,,53245000AM0162,,,,,,,,,,,,,0,,,,,P,prés,,,5101,-0.99497,48.29973
2021-888069,2021-05-11,000001,Vente,198474.5,,,GRAND BOUE,B084,53500,53245,Saint-Pierre-des-Landes,53,,,53245000AS0091,,,,,,,,,,,,,0,,,,,S,sols,,,1460,-1.013724,48.298313
2021-888069,2021-05-11,000001,Vente,198474.5,,,GRAND BOUE,B084,53500,53245,Saint-Pierre-des-Landes,53,,,53245000AS0092,,,,,,,,,,,,,0,,,,,T,terres,,,11370,-1.015294,48.297746
2021-888069,2021-05-11,000001,Vente,198474.5,,,GRAND BOUE,B084,53500,53245,Saint-Pierre-des-Landes,53,,,53245000AS0092,,,,,,,,,,,,,0,,,,,S,sols,,,6460,-1.015294,48.297746
2021-888069,2021-05-11,000001,Vente,198474.5,,,GRAND BOUE,B084,53500,53245,Saint-Pierre-des-Landes,53,,,53245000AS0093,,,,,,,,,,,,,0,,,,,T,terres,,,5050,-1.014214,48.298584
2021-888069,2021-05-11,000001,Vente,198474.5,,,GRAND BOUE,B084,53500,53245,Saint-Pierre-des-Landes,53,,,53245000AS0130,,,,,,,,,,,,,0,,,,,T,terres,CHEM,Chemin (non groupe),80,-1.014458,48.297428
2021-888069,2021-05-11,000001,Vente,198474.5,,,GRAND BOUE,B084,53500,53245,Saint-Pierre-des-Landes,53,,,53245000AS0144,,,,,,,,,,,,,0,,,,,T,terres,,,7,-1.012677,48.298399
2021-888069,2021-05-11,000001,Vente,198474.5,,,GRAND BOUE,B084,53500,53245,Saint-Pierre-des-Landes,53,,,53245000AS0146,,,,,,,,,,,,,0,,,,,T,terres,,,1530,-1.013702,48.297706
2021-888069,2021-05-11,000001,Vente,198474.5,,,GRAND BOUE,B084,53500,53245,Saint-Pierre-des-Landes,53,,,53245000AS0148,,,,,,,,,,,,,0,,,,,T,terres,,,790,-1.01302,48.298121
2021-888069,2021-05-11,000001,Vente,198474.5,,,GRAND BOUE,B084,53500,53245,Saint-Pierre-des-Landes,53,,,53245000AS0150,,,,,,,,,,,,,0,,,,,T,terres,CHEM,Chemin (non groupe),17,-1.014364,48.297422
2021-888069,2021-05-11,000001,Vente,198474.5,,,GRAND BOUE,B084,53500,53245,Saint-Pierre-des-Landes,53,,,53245000AS0156,,,,,,,,,,,,,0,,,,,S,sols,,,1011,-1.013797,48.298043
2021-888069,2021-05-11,000001,Vente,198474.5,,,RTE DE MEGAUDAIS,0076,53500,53245,Saint-Pierre-des-Landes,53,,,53245000AS0159,,,,,,,,,,,,,0,,,,,S,sols,,,55,-1.013397,48.298237
2021-888069,2021-05-11,000001,Vente,198474.5,,,GRAND BOUE,B084,53500,53245,Saint-Pierre-des-Landes,53,,,53245000AS0160,,,,,,,,,,,,,0,,,,,S,sols,,,1604,-1.013677,48.297969
2021-888069,2021-05-11,000001,Vente,198474.5,,,GRAND BOUE,B084,53500,53245,Saint-Pierre-des-Landes,53,,,53245000AS0163,,,,,,,,,,,,,0,,,,,S,sols,,,20,-1.013227,48.298096
2021-888550,2021-06-18,000002,Vente,9000,,,PAIN TOUT SEC,B147,53500,53245,Saint-Pierre-des-Landes,53,,,53245000AN0016,,,,,,,,,,,,,0,,,,,BM,futaies mixtes,,,5150,-0.98996,48.297654
2021-888550,2021-06-18,000002,Vente,9000,,,LES HAUTS VERRIERES,B114,53500,53245,Saint-Pierre-des-Landes,53,,,53245000AN0075,,,,,,,,,,,,,0,,,,,BT,taillis simples,,,680,-0.992337,48.296691
2021-888550,2021-06-18,000002,Vente,9000,,,LA OUVINAIS,B146,53500,53245,Saint-Pierre-des-Landes,53,,,53245000AN0080,,,,,,,,,,,,,0,,,,,BT,taillis simples,,,1640,-0.99518,48.296359
2021-888550,2021-06-18,000002,Vente,9000,,,LA OUVINAIS,B146,53500,53245,Saint-Pierre-des-Landes,53,,,53245000AN0086,,,,,,,,,,,,,0,,,,,BM,futaies mixtes,,,1500,-0.990814,48.298643
2021-888550,2021-06-18,000002,Vente,9000,,,LA OUVINAIS,B146,53500,53245,Saint-Pierre-des-Landes,53,,,53245000AN0087,,,,,,,,,,,,,0,,,,,BP,peupleraies,,,800,-0.990399,48.298929
2021-888699,2021-06-18,000001,Vente,2000,,,LES BAS VERRIERES,B015,53500,53245,Saint-Pierre-des-Landes,53,,,53245000AS0043,,,,,,,,,,,,,0,,,,,P,prés,,,9990,-1.000366,48.293468
2021-889041,2021-07-08,000002,Vente,74000,29,,RUE DE LA LIBERATION,0074,53500,53245,Saint-Pierre-des-Landes,53,,,53245000AZ0470,,,,,,,,,,,,,0,1,Maison,71,3,,,,,,-1.030967,48.27544
2021-889370,2021-07-16,000001,Vente,135000,4,,RUE DES LILAS,0075,53500,53245,Saint-Pierre-des-Landes,53,,,53245000AZ0318,,,,,,,,,,,,,0,1,Maison,96,5,S,sols,,,587,-1.023188,48.273958
2021-889834,2021-07-22,000001,Vente,15000,,,LA CAVESSERIE,B051,53500,53245,Saint-Pierre-des-Landes,53,,,53245000AL0095,,,,,,,,,,,,,0,,,,,S,sols,,,135,-0.995385,48.313779