id_mutation,date_mutation,numero_disposition,nature_mutation,valeur_fonciere,adresse_numero,adresse_suffixe,adresse_nom_voie,adresse_code_voie,code_postal,code_commune,nom_commune,code_departement,ancien_code_commune,ancien_nom_commune,id_parcelle,ancien_id_parcelle,numero_volume,lot1_numero,lot1_surface_carrez,lot2_numero,lot2_surface_carrez,lot3_numero,lot3_surface_carrez,lot4_numero,lot4_surface_carrez,lot5_numero,lot5_surface_carrez,nombre_lots,code_type_local,type_local,surface_reelle_bati,nombre_pieces_principales,code_nature_culture,nature_culture,code_nature_culture_speciale,nature_culture_speciale,surface_terrain,longitude,latitude
2021-885600,2021-02-08,000001,Vente,126000,275,,CHE DE LA MONNAIRIE,0022,53270,53264,Thorigné-en-Charnie,53,,,53264000ZI0003,,,,,,,,,,,,,0,1,Maison,131,4,S,sols,,,176,-0.371291,48.011181
2021-885600,2021-02-08,000001,Vente,126000,275,,CHE DE LA MONNAIRIE,0022,53270,53264,Thorigné-en-Charnie,53,,,53264000ZI0003,,,,,,,,,,,,,0,1,Maison,131,4,J,jardins,,,1854,-0.371291,48.011181
2021-885837,2021-02-15,000004,Vente,,,,LA MOTTE,B543,53270,53264,Thorigné-en-Charnie,53,,,53264000ZK0019,,,,,,,,,,,,,0,,,,,S,sols,,,118,-0.354623,48.012588
2021-885837,2021-02-15,000004,Vente,,,,LA MOTTE,B543,53270,53264,Thorigné-en-Charnie,53,,,53264000ZK0021,,,,,,,,,,,,,0,,,,,P,prés,,,102,-0.354678,48.012587
2021-885837,2021-02-15,000006,Vente,,,,LA MOTTE,B543,53270,53264,Thorigné-en-Charnie,53,,,53264000ZK0019,,,,,,,,,,,,,0,,,,,S,sols,,,118,-0.354623,48.012588
2021-885837,2021-02-15,000006,Vente,,,,LA MOTTE,B543,53270,53264,Thorigné-en-Charnie,53,,,53264000ZK0021,,,,,,,,,,,,,0,,,,,P,prés,,,102,-0.354678,48.012587
2021-886000,2021-02-25,000001,Vente,161000,13,,RUE DE LA CHARNIE,0005,53270,53264,Thorigné-en-Charnie,53,,,532640000E0060,,,,,,,,,,,,,0,1,Maison,140,6,S,sols,,,520,-0.35849,48.001007
2021-886000,2021-02-25,000001,Vente,161000,13,,RUE DE LA CHARNIE,0005,53270,53264,Thorigné-en-Charnie,53,,,532640000E0060,,,,,,,,,,,,,0,1,Maison,35,1,S,sols,,,520,-0.35849,48.001007
2021-886000,2021-02-25,000001,Vente,161000,,,LE BOURG,B065,53270,53264,Thorigné-en-Charnie,53,,,532640000E0061,,,,,,,,,,,,,0,,,,,J,jardins,,,845,-0.358818,48.001121
2021-886000,2021-02-25,000001,Vente,161000,,,LA GILBERDIERE,B324,53270,53264,Thorigné-en-Charnie,53,,,53264000ZE0007,,,,,,,,,,,,,0,,,,,P,prés,,,2140,-0.360676,48.000413
2021-886000,2021-02-25,000001,Vente,161000,,,LA MARE COMMUNALE,B487,53270,53264,Thorigné-en-Charnie,53,,,53264000ZE0042,,,,,,,,,,,,,0,,,,,E,eaux,MARE,Mare,180,-0.360893,48.000552
2021-886064,2021-03-19,000001,Vente,67337.9,,,LA MAUBERT,B528,53270,53264,Thorigné-en-Charnie,53,,,53264000ZI0027,,,,,,,,,,,,,0,,,,,T,terres,,,68160,-0.376645,48.01018
2021-886064,2021-03-19,000001,Vente,67337.9,,,LA MAUBERT,B528,53270,53264,Thorigné-en-Charnie,53,,,53264000ZI0027,,,,,,,,,,,,,0,,,,,P,prés,,,80544,-0.376645,48.01018
2021-886064,2021-03-19,000001,Vente,67337.9,,,LA MAUBERT,B528,53270,53264,Thorigné-en-Charnie,53,,,53264000ZI0027,,,,,,,,,,,,,0,,,,,VE,vergers,,,8371,-0.376645,48.01018
2021-886185,2021-03-10,000001,Vente,77000,,,LA JEUNERIE,B450,53270,53264,Thorigné-en-Charnie,53,,,532640000E0280,,,,,,,,,,,,,0,,,,,S,sols,,,40,-0.369878,47.995043
2021-886185,2021-03-10,000001,Vente,77000,,,LE PRE DE L AIRE,B673,53270,53264,Thorigné-en-Charnie,53,,,532640000E0281,,,,,,,,,,,,,0,,,,,P,prés,,,12825,-0.370114,47.995361
2021-886185,2021-03-10,000001,Vente,77000,,,LA MARE DE LA JEUNERIE,B501,53270,53264,Thorigné-en-Charnie,53,,,532640000E0429,,,,,,,,,,,,,0,,,,,E,eaux,MARE,Mare,56,-0.369804,47.994761
2021-886185,2021-03-10,000001,Vente,77000,,,LA CROIX BACHELOT,B273,53270,53264,Thorigné-en-Charnie,53,,,53264000ZE0012,,,,,,,,,,,,,0,,,,,P,prés,,,4810,-0.369637,47.996263
2021-886185,2021-03-10,000001,Vente,77000,60,,CHE DE LA CROIX BACHELOT,0012,53270,53264,Thorigné-en-Charnie,53,,,53264000ZE0039,,,,,,,,,,,,,0,1,Maison,129,4,S,sols,,,322,-0.369003,47.996561
2021-886185,2021-03-10,000001,Vente,77000,60,,CHE DE LA CROIX BACHELOT,0012,53270,53264,Thorigné-en-Charnie,53,,,53264000ZE0039,,,,,,,,,,,,,0,1,Maison,129,4,J,jardins,,,1231,-0.369003,47.996561
2021-886185,2021-03-10,000001,Vente,77000,,,LA CROIX BACHELOT,B273,53270,53264,Thorigné-en-Charnie,53,,,53264000ZE0041,,,,,,,,,,,,,0,,,,,S,sols,,,67,-0.368826,47.996693
2021-889317,2021-07-10,000001,Vente,23000,,,LE TAPET,B806,53270,53264,Thorigné-en-Charnie,53,,,532640000E0331,,,,,,,,,,,,,0,,,,,P,prés,,,24910,-0.344203,47.993487
2021-889317,2021-07-10,000001,Vente,23000,,,LE VIEUX PRE,B855,53270,53264,Thorigné-en-Charnie,53,,,532640000E0332,,,,,,,,,,,,,0,,,,,P,prés,,,31483,-0.345943,47.994189
2021-889582,2021-07-21,000001,Vente,38850,10,,RUE DE LA CHARNIE,0005,53270,53264,Thorigné-en-Charnie,53,,,532640000E0043,,,,,,,,,,,,,0,1,Maison,70,4,S,sols,,,417,-0.358556,48.000343
2021-889582,2021-07-21,000001,Vente,38850,10,,RUE DE LA CHARNIE,0005,53270,53264,Thorigné-en-Charnie,53,,,532640000E0043,,,,,,,,,,,,,0,3,Dépendance,,0,S,sols,,,417,-0.358556,48.000343
2021-890027,2021-07-27,000001,Vente,137500,,,LE BOURG,B065,53270,53264,Thorigné-en-Charnie,53,,,532640000E0038,,,,,,,,,,,,,0,,,,,J,jardins,,,1310,-0.358174,48.000326
2021-890027,2021-07-27,000001,Vente,137500,1,,RUE PERRINE DUGUE,0020,53270,53264,Thorigné-en-Charnie,53,,,532640000E0556,,,,,,,,,,,,,0,1,Maison,127,7,S,sols,,,496,-0.35813,48.000615
2021-890027,2021-07-27,000001,Vente,137500,,,LE BOURG,B065,53270,53264,Thorigné-en-Charnie,53,,,532640000E0559,,,,,,,,,,,,,0,,,,,S,sols,,,7,-0.357967,48.000749
2021-893181,2021-12-07,000001,Vente,1000,,,LA JOUASSIERE,B452,53270,53264,Thorigné-en-Charnie,53,,,53264000ZC0014,,,,,,,,,,,,,0,,,,,P,prés,,,1932,-0.339843,48.0157
