id_mutation,date_mutation,numero_disposition,nature_mutation,valeur_fonciere,adresse_numero,adresse_suffixe,adresse_nom_voie,adresse_code_voie,code_postal,code_commune,nom_commune,code_departement,ancien_code_commune,ancien_nom_commune,id_parcelle,ancien_id_parcelle,numero_volume,lot1_numero,lot1_surface_carrez,lot2_numero,lot2_surface_carrez,lot3_numero,lot3_surface_carrez,lot4_numero,lot4_surface_carrez,lot5_numero,lot5_surface_carrez,nombre_lots,code_type_local,type_local,surface_reelle_bati,nombre_pieces_principales,code_nature_culture,nature_culture,code_nature_culture_speciale,nature_culture_speciale,surface_terrain,longitude,latitude
2021-912514,2021-07-01,000001,Vente,5000,5001,,RUE DE LA ROCHE,0006,54470,54470,Saint-Baussant,54,,,54470000ZE0051,,,,,,,,,,,,,0,3,Dépendance,,0,T,terres,,,1200,5.787728,48.890781
2021-912514,2021-07-01,000001,Vente,5000,5001,,RUE DE LA ROCHE,0006,54470,54470,Saint-Baussant,54,,,54470000ZE0051,,,,,,,,,,,,,0,3,Dépendance,,0,J,jardins,,,768,5.787728,48.890781
2021-912514,2021-07-01,000001,Vente,5000,5001,,RUE DE LA ROCHE,0006,54470,54470,Saint-Baussant,54,,,54470000ZE0051,,,,,,,,,,,,,0,3,Dépendance,,0,S,sols,,,12,5.787728,48.890781
2021-912514,2021-07-01,000001,Vente,5000,5001,,RUE DE LA ROCHE,0006,54470,54470,Saint-Baussant,54,,,54470000ZE0051,,,,,,,,,,,,,0,3,Dépendance,,0,S,sols,,,12,5.787728,48.890781
2021-912514,2021-07-01,000001,Vente,5000,5001,,RUE DE LA ROCHE,0006,54470,54470,Saint-Baussant,54,,,54470000ZE0051,,,,,,,,,,,,,0,3,Dépendance,,0,T,terres,,,1200,5.787728,48.890781
2021-912514,2021-07-01,000001,Vente,5000,5001,,RUE DE LA ROCHE,0006,54470,54470,Saint-Baussant,54,,,54470000ZE0051,,,,,,,,,,,,,0,3,Dépendance,,0,J,jardins,,,768,5.787728,48.890781
2021-912698,2021-07-27,000001,Vente,77000,6,,RUE DE LA ROCHE,0006,54470,54470,Saint-Baussant,54,,,54470000AA0004,,,,,,,,,,,,,0,1,Maison,72,2,S,sols,,,909,5.788621,48.892247
2021-912812,2021-08-20,000001,Vente,1000,,,RUE DE LA LOUVIERE,0003,54470,54470,Saint-Baussant,54,,,54470000AA0046,,,,,,,,,,,,,0,,,,,P,prés,,,1793,5.794739,48.892016
2021-912898,2021-08-20,000001,Vente,500,,,RUE DE LA LOUVIERE,0003,54470,54470,Saint-Baussant,54,,,54470000AA0047,,,,,,,,,,,,,0,,,,,L,landes,,,230,5.794374,48.892137
2021-912900,2021-08-30,000001,Vente,11000,,,LE VILLAGE,B060,54470,54470,Saint-Baussant,54,,,54470000AA0083,,,,,,,,,,,,,0,,,,,J,jardins,,,324,5.792103,48.892471
2021-912900,2021-08-30,000001,Vente,11000,4,,RUE DE LA RENOMMIERE,0005,54470,54470,Saint-Baussant,54,,,54470000AA0113,,2,,,,,,,,,,,0,,,,,,,,,,5.792372,48.892637
2021-912900,2021-08-30,000001,Vente,11000,4,,RUE DE LA RENOMMIERE,0005,54470,54470,Saint-Baussant,54,,,54470000AA0114,,,,,,,,,,,,,0,,,,,S,sols,,,419,5.792345,48.892532
