id_mutation,date_mutation,numero_disposition,nature_mutation,valeur_fonciere,adresse_numero,adresse_suffixe,adresse_nom_voie,adresse_code_voie,code_postal,code_commune,nom_commune,code_departement,ancien_code_commune,ancien_nom_commune,id_parcelle,ancien_id_parcelle,numero_volume,lot1_numero,lot1_surface_carrez,lot2_numero,lot2_surface_carrez,lot3_numero,lot3_surface_carrez,lot4_numero,lot4_surface_carrez,lot5_numero,lot5_surface_carrez,nombre_lots,code_type_local,type_local,surface_reelle_bati,nombre_pieces_principales,code_nature_culture,nature_culture,code_nature_culture_speciale,nature_culture_speciale,surface_terrain,longitude,latitude
2021-913416,2021-02-10,000001,Vente,6000,,,SOUS LE SARRE,B045,55300,55054,Bislée,55,,,550540000B0772,,,,,,,,,,,,,0,,,,,B,bois,,,240,5.509014,48.866339
2021-913416,2021-02-10,000001,Vente,6000,,,SOUS LE SARRE,B045,55300,55054,Bislée,55,,,550540000B0772,,,,,,,,,,,,,0,,,,,BT,taillis simples,,,510,5.509014,48.866339
2021-913416,2021-02-10,000001,Vente,6000,,,LA CERISIERE,B006,55300,55054,Bislée,55,,,550540000B1054,,,,,,,,,,,,,0,,,,,B,bois,,,193,5.509382,48.866487
2021-913416,2021-02-10,000001,Vente,6000,,,LA CERISIERE,B006,55300,55054,Bislée,55,,,550540000B1054,,,,,,,,,,,,,0,,,,,BT,taillis simples,,,412,5.509382,48.866487
2021-913416,2021-02-10,000001,Vente,6000,,,LA CERISIERE,B006,55300,55054,Bislée,55,,,550540000B1055,,,,,,,,,,,,,0,,,,,T,terres,,,375,5.509537,48.866349
2021-913416,2021-02-10,000001,Vente,6000,,,SOUS LE SARRE,B045,55300,55054,Bislée,55,,,550540000B1058,,,,,,,,,,,,,0,,,,,B,bois,,,259,5.508862,48.866373
2021-913416,2021-02-10,000001,Vente,6000,,,SOUS LE SARRE,B045,55300,55054,Bislée,55,,,550540000B1058,,,,,,,,,,,,,0,,,,,BT,taillis simples,,,551,5.508862,48.866373
2021-913416,2021-02-10,000001,Vente,6000,,,SOUS LE SARRE,B045,55300,55054,Bislée,55,,,550540000B1059,,,,,,,,,,,,,0,,,,,T,terres,,,1200,5.50915,48.866244
2021-913555,2021-02-26,000001,Vente,178000,16,,RUE DU VIEUX MOULIN,0005,55300,55054,Bislée,55,,,55054000AA0081,,,,,,,,,,,,,0,1,Maison,135,7,S,sols,,,917,5.496661,48.867149
2021-914541,2021-05-17,000001,Vente,72500,,,LE VILLAGE,B047,55300,55054,Bislée,55,,,55054000AA0040,,,,,,,,,,,,,0,,,,,T,terres,,,112,5.494178,48.866972
2021-914541,2021-05-17,000001,Vente,72500,,,LE VILLAGE,B047,55300,55054,Bislée,55,,,55054000AA0041,,,,,,,,,,,,,0,,,,,T,terres,,,700,5.494078,48.867482
2021-914541,2021-05-17,000001,Vente,72500,4,,RUE DU VIEUX MOULIN,0005,55300,55054,Bislée,55,,,55054000AA0042,,,,,,,,,,,,,0,1,Maison,100,3,S,sols,,,906,5.493973,48.867999
2021-914541,2021-05-17,000001,Vente,72500,,,LE VILLAGE,B047,55300,55054,Bislée,55,,,55054000AA0043,,,,,,,,,,,,,0,,,,,S,sols,,,234,5.493704,48.868
2021-916996,2021-10-21,000001,Vente,45000,9005,,LA CERISIERE,B006,55300,55054,Bislée,55,,,550540000B1049,,,,,,,,,,,,,0,1,Maison,60,2,S,sols,,,780,5.51002,48.866685
2021-916996,2021-10-21,000001,Vente,45000,,,LA CERISIERE,B006,55300,55054,Bislée,55,,,550540000B1050,,,,,,,,,,,,,0,,,,,J,jardins,POTAG,Jardin potager,480,5.51019,48.866504
2021-916996,2021-10-21,000001,Vente,45000,,,LA CERISIERE,B006,55300,55054,Bislée,55,,,550540000B1129,,,,,,,,,,,,,0,,,,,BT,taillis simples,,,99,5.509798,48.866587
2021-916996,2021-10-21,000001,Vente,45000,,,LA CERISIERE,B006,55300,55054,Bislée,55,,,550540000B1129,,,,,,,,,,,,,0,,,,,B,bois,,,46,5.509798,48.866587
2021-916996,2021-10-21,000001,Vente,45000,,,LA CERISIERE,B006,55300,55054,Bislée,55,,,550540000B1131,,,,,,,,,,,,,0,,,,,T,terres,,,108,5.509926,48.866436
