id_mutation,date_mutation,numero_disposition,nature_mutation,valeur_fonciere,adresse_numero,adresse_suffixe,adresse_nom_voie,adresse_code_voie,code_postal,code_commune,nom_commune,code_departement,ancien_code_commune,ancien_nom_commune,id_parcelle,ancien_id_parcelle,numero_volume,lot1_numero,lot1_surface_carrez,lot2_numero,lot2_surface_carrez,lot3_numero,lot3_surface_carrez,lot4_numero,lot4_surface_carrez,lot5_numero,lot5_surface_carrez,nombre_lots,code_type_local,type_local,surface_reelle_bati,nombre_pieces_principales,code_nature_culture,nature_culture,code_nature_culture_speciale,nature_culture_speciale,surface_terrain,longitude,latitude
2021-914202,2021-03-29,000001,Vente,1345,,,BERMONT,B002,55290,55133,Couvertpuis,55,,,551330000C0290,,,,,,,,,,,,,0,,,,,B,bois,,,916,5.278665,48.576742
2021-914202,2021-03-29,000001,Vente,1345,,,BERMONT,B002,55290,55133,Couvertpuis,55,,,551330000C0290,,,,,,,,,,,,,0,,,,,BT,taillis simples,,,1374,5.278665,48.576742
2021-914202,2021-03-29,000001,Vente,1345,,,BERMONT,B002,55290,55133,Couvertpuis,55,,,551330000C0315,,,,,,,,,,,,,0,,,,,BT,taillis simples,,,1716,5.280587,48.577643
2021-914202,2021-03-29,000001,Vente,1345,,,BERMONT,B002,55290,55133,Couvertpuis,55,,,551330000C0315,,,,,,,,,,,,,0,,,,,B,bois,,,1144,5.280587,48.577643
2021-914569,2021-04-28,000001,Vente,18000,,,LE VILLAGE,B069,55290,55133,Couvertpuis,55,,,551330000B0932,,,,,,,,,,,,,0,,,,,S,sols,,,22,5.302523,48.582753
2021-914569,2021-04-28,000001,Vente,18000,,,LE VILLAGE,B069,55290,55133,Couvertpuis,55,,,551330000B1066,,,,,,,,,,,,,0,,,,,J,jardins,POTAG,Jardin potager,317,5.302825,48.582459
2021-914569,2021-04-28,000001,Vente,18000,14,,RUE POIRIERE,0032,55290,55133,Couvertpuis,55,,,551330000B1069,,,,,,,,,,,,,0,1,Maison,80,2,S,sols,,,412,5.302686,48.582577
2021-916380,2021-08-17,000001,Vente,37500,,,DERRIERE LES RIPPES,B023,55290,55133,Couvertpuis,55,,,55133000ZL0035,,,,,,,,,,,,,0,,,,,T,terres,,,7500,5.288836,48.57791
2021-916380,2021-08-17,000001,Vente,37500,,,DERRIERE LES RIPPES,B023,55290,55133,Couvertpuis,55,,,55133000ZL0035,,,,,,,,,,,,,0,,,,,T,terres,,,15000,5.288836,48.57791
2021-916380,2021-08-17,000001,Vente,37500,,,DERRIERE LES RIPPES,B023,55290,55133,Couvertpuis,55,,,55133000ZL0035,,,,,,,,,,,,,0,,,,,T,terres,,,30000,5.288836,48.57791
2021-916380,2021-08-17,000001,Vente,37500,,,DERRIERE LES RIPPES,B023,55290,55133,Couvertpuis,55,,,55133000ZL0035,,,,,,,,,,,,,0,,,,,T,terres,,,22500,5.288836,48.57791
2021-917461,2021-11-02,000001,Vente,163500,,,LE VILLAGE,B069,55290,55133,Couvertpuis,55,,,551330000B0864,,,,,,,,,,,,,0,,,,,J,jardins,POTAG,Jardin potager,880,5.304619,48.581619
2021-917461,2021-11-02,000001,Vente,163500,1,,RUE DE BIENCOURT,0005,55290,55133,Couvertpuis,55,,,551330000B0865,,,,,,,,,,,,,0,1,Maison,100,4,S,sols,,,672,5.304293,48.581466
2021-917461,2021-11-02,000001,Vente,163500,,,LE VILLAGE,B069,55290,55133,Couvertpuis,55,,,551330000B0866,,,,,,,,,,,,,0,,,,,P,prés,,,348,5.304217,48.581576
2021-917461,2021-11-02,000001,Vente,163500,,,LE VILLAGE,B069,55290,55133,Couvertpuis,55,,,551330000B0965,,,,,,,,,,,,,0,,,,,J,jardins,POTAG,Jardin potager,350,5.304427,48.581403
2021-917946,2021-12-22,000001,Vente,70000,,,FROMONT,B030,55290,55133,Couvertpuis,55,,,55133000ZC0017,,,,,,,,,,,,,0,,,,,T,terres,,,47068,5.314093,48.590053
2021-917946,2021-12-22,000001,Vente,70000,,,FROMONT,B030,55290,55133,Couvertpuis,55,,,55133000ZC0017,,,,,,,,,,,,,0,,,,,T,terres,,,70602,5.314093,48.590053
