id_mutation,date_mutation,numero_disposition,nature_mutation,valeur_fonciere,adresse_numero,adresse_suffixe,adresse_nom_voie,adresse_code_voie,code_postal,code_commune,nom_commune,code_departement,ancien_code_commune,ancien_nom_commune,id_parcelle,ancien_id_parcelle,numero_volume,lot1_numero,lot1_surface_carrez,lot2_numero,lot2_surface_carrez,lot3_numero,lot3_surface_carrez,lot4_numero,lot4_surface_carrez,lot5_numero,lot5_surface_carrez,nombre_lots,code_type_local,type_local,surface_reelle_bati,nombre_pieces_principales,code_nature_culture,nature_culture,code_nature_culture_speciale,nature_culture_speciale,surface_terrain,longitude,latitude
2021-913802,2021-02-24,000001,Vente,136000,9,,RUE DE DOMBRAS,0030,55150,55149,Delut,55,,,55149000AB0068,,,,,,,,,,,,,0,1,Maison,120,6,S,sols,,,205,5.434226,49.408225
2021-913802,2021-02-24,000001,Vente,136000,,,LE VILLAGE,B077,55150,55149,Delut,55,,,55149000AB0069,,,,,,,,,,,,,0,,,,,J,jardins,POTAG,Jardin potager,830,5.434242,49.40826
2021-913802,2021-02-24,000001,Vente,136000,,,LE VILLAGE,B077,55150,55149,Delut,55,,,55149000AB0183,,,,,,,,,,,,,0,,,,,T,terres,,,383,5.434399,49.40836
2021-913802,2021-02-24,000001,Vente,136000,,,LE VILLAGE,B077,55150,55149,Delut,55,,,55149000AB0234,,,,,,,,,,,,,0,,,,,T,terres,,,631,5.434207,49.408645
2021-913802,2021-02-24,000001,Vente,136000,,,LE VILLAGE,B077,55150,55149,Delut,55,,,55149000AB0236,,,,,,,,,,,,,0,,,,,T,terres,,,377,5.433909,49.40884
2021-914676,2021-05-10,000001,Vente,65000,2,,RUE DU CHATEAU,0010,55150,55149,Delut,55,,,55149000AB0090,,,,,,,,,,,,,0,1,Maison,125,3,S,sols,,,350,5.431536,49.407459
2021-914676,2021-05-10,000001,Vente,65000,,,LE VILLAGE,B077,55150,55149,Delut,55,,,55149000AB0105,,,,,,,,,,,,,0,,,,,J,jardins,POTAG,Jardin potager,165,5.432506,49.406903
2021-915143,2021-06-11,000001,Vente,150000,3,B,RUE DE DOMBRAS,0030,55150,55149,Delut,55,,,55149000AB0059,,,,,,,,,,,,,0,2,Appartement,120,4,S,sols,,,585,5.433298,49.408241
2021-915143,2021-06-11,000001,Vente,150000,3,B,RUE DE DOMBRAS,0030,55150,55149,Delut,55,,,55149000AB0059,,,,,,,,,,,,,0,2,Appartement,135,5,S,sols,,,585,5.433298,49.408241
2021-917172,2021-10-18,000001,Vente,176400,1,B,RUE DU CUL DE SAC,0025,55150,55149,Delut,55,,,55149000AB0128,,,,,,,,,,,,,0,1,Maison,120,4,S,sols,,,295,5.429612,49.406797
2021-917570,2021-11-17,000001,Vente,8521.5,,,PAPINET,B043,55150,55149,Delut,55,,,55149000ZB0054,,,,,,,,,,,,,0,,,,,P,prés,,,13130,5.413074,49.415052
2021-917570,2021-11-17,000001,Vente,8521.5,,,DESSOUS LES QUARTIERS,B019,55150,55149,Delut,55,,,55149000ZE0014,,,,,,,,,,,,,0,,,,,P,prés,,,4625,5.432584,49.40628
2021-917570,2021-11-17,000001,Vente,8521.5,,,DESSOUS LES QUARTIERS,B019,55150,55149,Delut,55,,,55149000ZE0014,,,,,,,,,,,,,0,,,,,VE,vergers,,,1895,5.432584,49.40628
2021-917570,2021-11-17,000001,Vente,8521.5,,,DESSOUS LES QUARTIERS,B019,55150,55149,Delut,55,,,55149000ZE0015,,,,,,,,,,,,,0,,,,,P,prés,,,2200,5.432533,49.406752
2021-918005,2021-11-16,000001,Vente,153000,3,,RUE DES MARRAINS,0055,55150,55149,Delut,55,,,55149000AB0031,,,,,,,,,,,,,0,3,Dépendance,,0,S,sols,,,200,5.43087,49.408516
2021-918028,2021-12-06,000001,Vente,4800,,,LE VILLAGE,B077,55150,55149,Delut,55,,,55149000AB0230,,,,,,,,,,,,,0,,,,,P,prés,,,1559,5.427428,49.40861
2021-918033,2021-12-06,000001,Vente,6000,,,LE VILLAGE,B077,55150,55149,Delut,55,,,55149000AB0030,,,,,,,,,,,,,0,,,,,J,jardins,POTAG,Jardin potager,190,5.430977,49.408431
