id_mutation,date_mutation,numero_disposition,nature_mutation,valeur_fonciere,adresse_numero,adresse_suffixe,adresse_nom_voie,adresse_code_voie,code_postal,code_commune,nom_commune,code_departement,ancien_code_commune,ancien_nom_commune,id_parcelle,ancien_id_parcelle,numero_volume,lot1_numero,lot1_surface_carrez,lot2_numero,lot2_surface_carrez,lot3_numero,lot3_surface_carrez,lot4_numero,lot4_surface_carrez,lot5_numero,lot5_surface_carrez,nombre_lots,code_type_local,type_local,surface_reelle_bati,nombre_pieces_principales,code_nature_culture,nature_culture,code_nature_culture_speciale,nature_culture_speciale,surface_terrain,longitude,latitude
2021-913869,2021-03-11,000001,Vente,16187.5,,,LES MESSAGES,B073,55100,55180,Esnes-en-Argonne,55,,,55180000ZC0016,,,,,,,,,,,,,0,,,,,L,landes,FRICH,Friche,4320,5.230009,49.226592
2021-913869,2021-03-11,000001,Vente,16187.5,,,LES MESSAGES,B073,55100,55180,Esnes-en-Argonne,55,,,55180000ZC0016,,,,,,,,,,,,,0,,,,,T,terres,,,5780,5.230009,49.226592
2021-913869,2021-03-11,000001,Vente,16187.5,,,LES MESSAGES,B073,55100,55180,Esnes-en-Argonne,55,,,55180000ZC0017,,,,,,,,,,,,,0,,,,,T,terres,,,4570,5.226567,49.226453
2021-913869,2021-03-11,000001,Vente,16187.5,,,LES MESSAGES,B073,55100,55180,Esnes-en-Argonne,55,,,55180000ZC0017,,,,,,,,,,,,,0,,,,,L,landes,FRICH,Friche,29080,5.226567,49.226453
2021-914398,2021-04-23,000001,Vente,36000,24,,RUE 23E RIC,0015,55100,55180,Esnes-en-Argonne,55,,,55180000ZI0154,,,,,,,,,,,,,0,1,Maison,60,2,S,sols,,,783,5.215085,49.211289
2021-914398,2021-04-23,000001,Vente,36000,,,LE VILLAGE,B120,55100,55180,Esnes-en-Argonne,55,,,55180000ZI0156,,,,,,,,,,,,,0,,,,,P,prés,,,2641,5.216046,49.210671
2021-914398,2021-04-23,000001,Vente,36000,,,LE VILLAGE,B120,55100,55180,Esnes-en-Argonne,55,,,55180000ZI0156,,,,,,,,,,,,,0,,,,,T,terres,,,1572,5.216046,49.210671
2021-915317,2021-06-25,000001,Vente,1700,,,LA VERDURE,B116,55100,55180,Esnes-en-Argonne,55,,,55180000ZB0022,,,,,,,,,,,,,0,,,,,T,terres,,,3820,5.211118,49.211655
2021-915317,2021-06-25,000001,Vente,1700,,,LA VERDURE,B116,55100,55180,Esnes-en-Argonne,55,,,55180000ZB0022,,,,,,,,,,,,,0,,,,,L,landes,FRICH,Friche,1200,5.211118,49.211655
2021-916559,2021-09-14,000001,Vente,748,,,LA COULEUVRE,B024,55100,55180,Esnes-en-Argonne,55,,,55180000ZK0037,,,,,,,,,,,,,0,,,,,T,terres,,,1870,5.214707,49.200919
