id_mutation,date_mutation,numero_disposition,nature_mutation,valeur_fonciere,adresse_numero,adresse_suffixe,adresse_nom_voie,adresse_code_voie,code_postal,code_commune,nom_commune,code_departement,ancien_code_commune,ancien_nom_commune,id_parcelle,ancien_id_parcelle,numero_volume,lot1_numero,lot1_surface_carrez,lot2_numero,lot2_surface_carrez,lot3_numero,lot3_surface_carrez,lot4_numero,lot4_surface_carrez,lot5_numero,lot5_surface_carrez,nombre_lots,code_type_local,type_local,surface_reelle_bati,nombre_pieces_principales,code_nature_culture,nature_culture,code_nature_culture_speciale,nature_culture_speciale,surface_terrain,longitude,latitude
2021-913622,2021-03-01,000001,Vente,82900,,,LE VILLAGE,B026,55110,55208,Gesnes-en-Argonne,55,,,55208000AB0025,,,,,,,,,,,,,0,,,,,L,landes,,,100,5.061504,49.305909
2021-913622,2021-03-01,000001,Vente,82900,,,LE VILLAGE,B026,55110,55208,Gesnes-en-Argonne,55,,,55208000AB0047,,,,,,,,,,,,,0,,,,,S,sols,,,395,5.061337,49.30548
2021-913622,2021-03-01,000001,Vente,82900,,,LE VILLAGE,B026,55110,55208,Gesnes-en-Argonne,55,,,55208000AB0101,,,,,,,,,,,,,0,,,,,S,sols,,,7,5.061715,49.30584
2021-913622,2021-03-01,000001,Vente,82900,,,LE VILLAGE,B026,55110,55208,Gesnes-en-Argonne,55,,,55208000AB0102,,,,,,,,,,,,,0,,,,,S,sols,,,17,5.061602,49.305916
2021-913622,2021-03-01,000001,Vente,82900,,,LE VILLAGE,B026,55110,55208,Gesnes-en-Argonne,55,,,55208000AB0103,,,,,,,,,,,,,0,,,,,S,sols,,,133,5.061669,49.305834
2021-913622,2021-03-01,000001,Vente,82900,,,LE VILLAGE,B026,55110,55208,Gesnes-en-Argonne,55,,,55208000AB0116,,,,,,,,,,,,,0,,,,,J,jardins,POTAG,Jardin potager,90,5.061789,49.305717
2021-913622,2021-03-01,000001,Vente,82900,1,,RTE DE VARENNES,0020,55110,55208,Gesnes-en-Argonne,55,,,55208000AB0117,,,,,,,,,,,,,0,1,Maison,75,3,S,sols,,,723,5.061538,49.30572
2021-913622,2021-03-01,000001,Vente,82900,,,LE VILLAGE,B026,55110,55208,Gesnes-en-Argonne,55,,,55208000AB0120,,,,,,,,,,,,,0,,,,,S,sols,,,15,5.061699,49.30578
2021-913758,2021-02-26,000001,Vente,33000,,,LE VILLAGE,B026,55110,55208,Gesnes-en-Argonne,55,,,55208000AB0052,,,,,,,,,,,,,0,,,,,S,sols,,,270,5.06047,49.305236
2021-913758,2021-02-26,000001,Vente,33000,1,,RUE DU PORT,0015,55110,55208,Gesnes-en-Argonne,55,,,55208000AB0053,,,,,,,,,,,,,0,1,Maison,72,3,S,sols,,,275,5.060359,49.305192
2021-915199,2021-06-11,000001,Vente,48900,2,,RUE DES CHATS,0005,55110,55208,Gesnes-en-Argonne,55,,,55208000AB0024,,,,,,,,,,,,,0,1,Maison,103,4,S,sols,,,765,5.061296,49.30614
2021-915199,2021-06-11,000001,Vente,48900,,,LE VILLAGE,B026,55110,55208,Gesnes-en-Argonne,55,,,55208000AB0086,,,,,,,,,,,,,0,,,,,S,sols,,,43,5.06114,49.306103
2021-916309,2021-08-17,000001,Vente,82000,5,,RTE DE VARENNES,0020,55110,55208,Gesnes-en-Argonne,55,,,55208000AB0034,,,,,,,,,,,,,0,1,Maison,76,2,S,sols,,,375,5.062191,49.305274
2021-916309,2021-08-17,000001,Vente,82000,,,LE VILLAGE,B026,55110,55208,Gesnes-en-Argonne,55,,,55208000AB0035,,,,,,,,,,,,,0,,,,,P,prés,,,785,5.062254,49.305358
2021-916309,2021-08-17,000001,Vente,82000,,,LE VILLAGE,B026,55110,55208,Gesnes-en-Argonne,55,,,55208000AB0114,,,,,,,,,,,,,0,,,,,S,sols,,,240,5.062422,49.305158
2021-916309,2021-08-17,000001,Vente,82000,,,LE VILLAGE,B026,55110,55208,Gesnes-en-Argonne,55,,,55208000AB0121,,,,,,,,,,,,,0,,,,,S,sols,,,187,5.062605,49.305095
2021-916428,2021-08-31,000001,Vente,34933,,,LES TANIERES,B023,55110,55208,Gesnes-en-Argonne,55,,,55208000ZB0064,,,,,,,,,,,,,0,,,,,P,prés,,,41850,5.077501,49.306326
2021-916428,2021-08-31,000001,Vente,34933,,,LES TANIERES,B023,55110,55208,Gesnes-en-Argonne,55,,,55208000ZB0064,,,,,,,,,,,,,0,,,,,T,terres,,,28016,5.077501,49.306326
