id_mutation,date_mutation,numero_disposition,nature_mutation,valeur_fonciere,adresse_numero,adresse_suffixe,adresse_nom_voie,adresse_code_voie,code_postal,code_commune,nom_commune,code_departement,ancien_code_commune,ancien_nom_commune,id_parcelle,ancien_id_parcelle,numero_volume,lot1_numero,lot1_surface_carrez,lot2_numero,lot2_surface_carrez,lot3_numero,lot3_surface_carrez,lot4_numero,lot4_surface_carrez,lot5_numero,lot5_surface_carrez,nombre_lots,code_type_local,type_local,surface_reelle_bati,nombre_pieces_principales,code_nature_culture,nature_culture,code_nature_culture_speciale,nature_culture_speciale,surface_terrain,longitude,latitude
2021-914757,2021-05-10,000001,Vente,68280,,,LE BOURG,B010,55400,55325,Maucourt-sur-Orne,55,,,55325000AB0035,,,,,,,,,,,,,0,,,,,VE,vergers,,,3585,5.509976,49.249212
2021-914757,2021-05-10,000001,Vente,68280,6,,GR GRANDE RUE,0035,55400,55325,Maucourt-sur-Orne,55,,,55325000AB0038,,,,,,,,,,,,,0,1,Maison,96,4,S,sols,,,468,5.510153,49.248632
2021-914757,2021-05-10,000001,Vente,68280,,,A MARCHATON,B039,55400,55325,Maucourt-sur-Orne,55,,,553250000Y0094,,,,,,,,,,,,,0,,,,,P,prés,,,263,5.515731,49.241911
2021-914757,2021-05-10,000001,Vente,68280,,,A MARCHATON,B039,55400,55325,Maucourt-sur-Orne,55,,,553250000Y0094,,,,,,,,,,,,,0,,,,,L,landes,,,7813,5.515731,49.241911
2021-918208,2021-12-23,000001,Vente,126604.98,,,SUR LE HAUT DU BOIS,B032,55400,55325,Maucourt-sur-Orne,55,,,553250000A0090,,,,,,,,,,,,,0,,,,,P,prés,,,62638,5.494084,49.245242
2021-918208,2021-12-23,000001,Vente,126604.98,,,SUR BANONVAUX,B002,55400,55325,Maucourt-sur-Orne,55,,,553250000Y0046,,,,,,,,,,,,,0,,,,,P,prés,,,47581,5.522536,49.253595
2021-918208,2021-12-23,000001,Vente,126604.98,,,SUR BANONVAUX,B002,55400,55325,Maucourt-sur-Orne,55,,,553250000Y0046,,,,,,,,,,,,,0,,,,,T,terres,,,29417,5.522536,49.253595
2021-918208,2021-12-23,000001,Vente,126604.98,,,SUR BANONVAUX,B002,55400,55325,Maucourt-sur-Orne,55,,,553250000Y0047,,,,,,,,,,,,,0,,,,,P,prés,,,14226,5.525197,49.252678
2021-918208,2021-12-23,000001,Vente,126604.98,,,SUR BANONVAUX,B002,55400,55325,Maucourt-sur-Orne,55,,,553250000Y0047,,,,,,,,,,,,,0,,,,,T,terres,,,13020,5.525197,49.252678
2021-918209,2021-12-23,000002,Vente,179953.05,1,,RUE DU BOURG,0010,55400,55325,Maucourt-sur-Orne,55,,,55325000AB0263,,,,,,,,,,,,,0,1,Maison,88,4,VE,vergers,,,335,5.51606,49.248686
2021-918209,2021-12-23,000002,Vente,179953.05,1,,RUE DU BOURG,0010,55400,55325,Maucourt-sur-Orne,55,,,55325000AB0263,,,,,,,,,,,,,0,1,Maison,88,4,L,landes,,,1400,5.51606,49.248686
2021-918209,2021-12-23,000002,Vente,179953.05,1,,RUE DU BOURG,0010,55400,55325,Maucourt-sur-Orne,55,,,55325000AB0263,,,,,,,,,,,,,0,1,Maison,88,4,S,sols,,,3472,5.51606,49.248686
2021-918209,2021-12-23,000002,Vente,179953.05,1,,RUE DU BOURG,0010,55400,55325,Maucourt-sur-Orne,55,,,55325000AB0263,,,,,,,,,,,,,0,1,Maison,88,4,P,prés,,,3658,5.51606,49.248686
